program: Gaussian 09
title: 000186871
version: EM64L-G09RevD.01
frameworkgroup: C1[X(C11H11ClO2)]
method: RPBEPBE
basis: SDD
operation: Freq
keyword: #p
keyword: freq=noraman
keyword: PBEPBE/SDD
title: #p freq=noraman PBEPBE/SDD
converged: NO YES NO NO
title: Mulliken charges:
elementType: Cl O O C C C C C C C C C C C H H H H H H H H H H H
charge: -0.052917 -0.198316 -0.187168 -0.103166 -0.427385 -0.341848 0.545501 0.171929 -0.742728 -0.437062 -0.353210 -0.197335 -0.216971 -0.115846 0.262513 0.254489 0.236871 0.229435 0.230549 0.225747 0.226846 0.236609 0.240191 0.257101 0.256171
chargesum: 0.00000
title: Mulliken charges with hydrogens summed into heavy atoms:
elementType: Cl O O C C C C C C C C C C C
charge: -0.052917 -0.198316 -0.187168 0.159346 -0.172896 0.124458 0.545501 0.171929 -0.059586 -0.200453 -0.113019 0.059766 0.039200 -0.115846
polarizability: 1.77772171e+02 -2.69385302e+00 1.00921864e+02 2.89832559e+00 1.18545612e+01 1.04541808e+02
1716.lowfreq: -66.6400 -14.1440 -6.5846 -4.0632 -0.0020 -0.0016 0.0013 10.2279 54.2339
frequency: -66.5807 8.9723 54.1459 77.8113 123.1548 153.7696 212.8448 256.5503 258.2270 323.6545 336.3496 359.9859 406.6732 436.3092 476.7844 515.9211 563.2786 616.7362 627.0938 669.7216 696.3430 717.6073 811.6391 819.2363 828.8211 848.2685 873.7684 926.8328 943.8468 950.5930 964.4138 969.6171 1001.2016 1041.7856 1074.2663 1100.1808 1105.6168 1116.1347 1139.1632 1187.9015 1192.3309 1203.9141 1233.2897 1252.9661 1289.0435 1304.4868 1328.0900 1347.4836 1378.8512 1396.9181 1401.8172 1473.6327 1478.2554 1479.2860 1485.6975 1587.8668 1601.8310 1696.9273 2976.7112 3018.5688 3022.6088 3031.5222 3075.4659 3077.2974 3090.7533 3126.9036 3132.6840 3169.0556 3172.2168
redmass: 2.5870 4.0742 7.1111 8.6687 6.3035 5.4634 7.2438 2.6559 1.1893 5.1667 3.9953 3.8395 2.8804 4.4139 5.0671 3.5897 5.1195 6.0268 6.8940 6.6710 6.4854 3.6690 1.9576 2.9618 1.2610 4.4746 2.5844 1.2775 2.0885 1.7071 1.4372 3.0777 4.1705 2.8484 2.7170 2.1370 2.9693 1.6121 1.9563 1.1317 1.1520 1.8650 1.3545 1.4105 1.4370 1.4050 1.3859 1.3992 6.0493 1.2312 2.4173 1.0551 2.0162 1.1419 1.0807 7.3090 6.3081 12.8058 1.0359 1.0756 1.0690 1.0836 1.1004 1.1005 1.1080 1.0902 1.0901 1.0949 1.0960
irintensity: 2.4355 0.5725 2.2870 2.9899 0.3608 1.6927 0.5313 0.7281 0.0847 0.3668 1.2664 4.7301 0.0182 11.6618 2.6224 19.3341 20.7512 0.3823 0.4208 2.3534 9.2020 3.1613 31.9998 8.9741 0.0924 25.7464 34.4134 3.7189 20.1556 17.1738 3.9532 34.6187 40.2377 106.7173 44.6072 42.8513 85.5389 14.2104 3.7869 0.2631 0.3557 1.2391 5.0396 3.4583 2.4592 0.8959 1.1540 4.7644 0.7942 16.3214 3.4890 15.3457 63.8942 33.8958 1.7902 1.0712 5.8741 291.3606 25.1261 18.3619 28.9586 11.0854 30.5907 26.2378 36.0353 9.0011 10.3398 4.9018 0.6437
temp: 298.150 k
press: 1.00000 atm
elementType: 17 8 8 6 6 6 6 6 6 6 6 6 6 6 1 1 1 1 1 1 1 1 1 1 1
symmnumber: 1
zpe: 506150.1 jmol-1
zpe.correction: 0.192782 hartree
zpe.thermalcorrener: 0.204870 hartree
zpe.thermalcorrenthalpy: 0.205814 hartree
zpe.thermalcorrgfe: 0.151816 hartree
zpe.sumelectzpe: -1035.257372 hartree
zpe.sumelectthermal: -1035.245284 hartree
zpe.sumelectthermalent: -1035.244340 hartree
zpe.sumelectthermalfe: -1035.298338 hartree
dipole: -1.6034 4.7912 -2.0331
dipole: 5.4461
quadrupole: -94.8250 -95.5452 -85.4675
quadrupole: -11.8472 6.3774 8.9375
quadrupole: -2.8791 -3.5993 6.4784 -11.8472 6.3774 8.9375
hfenergy: -1035.4501542 hartree
pointgroup: C01 [X(C11H11Cl1O2)]
dipole: -0.5233543 1.8929983 -0.8565249 debye
dipolederiv: -0.853528 0.1064368 0.155381 0.1042524 -0.1097711 -0.0504028 0.1766036 -0.0538796 -0.137145 -0.8255225 0.197396 -0.4852293 -0.1482429 -0.4900067 0.1216119 -0.4280585 0.3435131 -0.7906118 -0.4995205 0.0002084 -0.113376 -0.0361871 -0.7651862 0.4442607 -0.1383714 0.3679238 -0.7447418 -0.0590758 -0.0541896 -0.020476 -0.0472361 0.0720868 0.0378085 -0.0172136 -0.0536382 0.0517204 -0.1792812 -0.138711 -0.0195863 -0.1877787 -0.1896866 0.0870203 -0.1329329 0.0946813 0.1065128 0.3098716 -0.0297972 -0.0170746 -0.0825901 0.3737147 -0.2083342 0.0932266 -0.1261356 0.4526871 0.4321798 -0.0317631 -0.0556065 -0.105799 -0.0883542 -0.0022329 -0.0572928 0.010311 -0.0685618 1.0462018 -0.0233854 0.6104284 0.4795496 0.9340407 -0.498642 0.5336061 -0.6294038 1.0939191 0.0215966 0.0168219 0.0052692 0.024853 -0.0066811 -0.0432663 -0.0452373 -0.0133235 0.0646761 -0.068982 -0.0070963 -0.0226582 0.0320507 -0.0447132 0.1018333 0.0184663 0.114265 -0.0039686 -0.0490424 0.0500578 0.0239192 0.0593878 -0.0423572 0.0872286 0.0175713 0.070468 -0.040862 -0.2560248 0.0853716 0.10596 0.097508 -0.0697602 0.0201505 0.1223726 0.0181424 -0.0734103 -0.3251453 0.0106281 0.0290118 -0.0061854 -0.034539 0.0687838 0.015259 0.0616434 -0.0336766 1.2108039 -0.1580822 -0.2548017 -0.1591845 0.0284715 0.121932 -0.26872 0.125725 0.0823256 0.0076623 -0.0292285 0.0996852 -0.0324271 0.0164407 -0.0035654 0.1287835 0.0137644 -0.0464337 0.0508638 -0.0170954 -0.0214444 0.0030565 0.0305077 -0.0643232 0.0288731 -0.0520318 -0.0460458 -0.1269048 0.0825172 -0.0209642 0.0971981 0.0128728 0.0538831 0.0274252 0.0159473 0.0531886 0.0876379 0.0076991 0.0562558 0.0074296 0.000576 -0.0356916 -0.0345869 -0.0228903 -0.1454579 -0.0295962 -0.1254997 -0.0589811 -0.0842371 -0.0113114 -0.0357212 -0.0348827 -0.074387 0.0717715 0.0031265 0.1032438 -0.083131 0.0895244 0.0118739 0.051837 -0.1037085 0.0993716 -0.0385828 -0.0029284 0.0014084 0.100499 -0.0432253 0.0546896 0.0601047 0.1233199 0.0057753 -0.0509966 0.0548588 0.0481864 0.0654529 0.0346115 0.050234 -0.1041688 0.0527401 -0.1072966 0.0185626 -0.0306188 -0.0685475 -0.0615882 -0.0716682 0.0857213 -0.0521578 -0.06632 -0.0509283 0.0753732 0.0065591 -0.0524217 -0.0499896 -0.0501925 0.1043726 -0.0638323 -0.0457589 -0.0634649 0.0945351 0.0748087 0.025842 0.0330448 0.0255325 0.0767648 -0.0941159 0.034836 -0.0941521 0.0552225 unknown
polarizability: 176.6943888|-8.8758776|103.4442742|-2.3388158|12.4574591|103.0971796 unknown
InChI: InChI=1S/C11H11ClO2/c1-7-6-14-11(13)10(7)8-2-4-9(12)5-3-8/h2-5,7,10H,6H2,1H3
charge 0 multiplicity 1
25 atoms
Cl 4.838884 -0.491821 -0.765021
O  -2.945693 -0.958909 -0.077402
O  -1.677616 -1.759403 1.687672
C  -1.877614 1.226752 -0.479032
C  -1.098305 0.441551 0.629084
C  -2.99651 0.243207 -0.950762
C  0.369531 0.179935 0.304739
C  -1.883374 -0.872504 0.847019
C  -2.457054 2.562189 0.032397
C  1.391268 0.863403 1.007009
C  0.73956 -0.721785 -0.726764
C  2.75416 0.667075 0.689048
C  2.094435 -0.93369 -1.057389
C  3.083914 -0.228872 -0.34403
H  -1.195769 1.434121 -1.322049
H  -1.146723 0.993707 1.586223
H  -4.006484 0.673186 -0.838641
H  -2.858887 -0.105723 -1.987939
H  -1.651404 3.240797 0.366724
H  -3.0235 3.080851 -0.762862
H  -3.142437 2.396541 0.884842
H  1.128857 1.552529 1.818184
H  -0.031014 -1.282128 -1.270491
H  3.539558 1.196085 1.236276
H  2.375919 -1.636196 -1.847137
