program: Gaussian 09
title: 000184808
version: EM64L-G09RevD.01
frameworkgroup: C1[X(C8H19N3O)]
method: RPBEPBE
basis: SDD
operation: Freq
keyword: #p
keyword: freq=noraman
keyword: PBEPBE/SDD
title: #p freq=noraman PBEPBE/SDD
converged: YES YES NO NO
title: Mulliken charges:
elementType: O N N N C C C C C C C C H H H H H H H H H H H H H H H H H H H
charge: -0.278597 -0.370066 -0.546137 -0.575674 -0.361137 -0.356106 -0.357767 -0.398060 -0.410323 0.239443 -0.497781 -0.378243 0.186655 0.187680 0.220672 0.197397 0.185569 0.190559 0.258115 0.207973 0.204706 0.205307 0.298376 0.221163 0.220513 0.232651 0.210138 0.261635 0.261920 0.261739 0.277682
chargesum: 0.00000
title: Mulliken charges with hydrogens summed into heavy atoms:
elementType: O N N N C C C C C C C C
charge: -0.278597 -0.071690 -0.022583 -0.036252 0.013198 0.061962 0.018360 0.068028 -0.000310 0.239443 -0.056105 0.064545
polarizability: 1.42204813e+02 4.78438871e+00 1.03546670e+02 3.66506168e+00 -4.62916767e-01 9.35820706e+01
1716.lowfreq: -2.7769 -0.0005 0.0003 0.0005 7.5738 9.1320 17.7106 34.5522 36.7134
frequency: 8.8195 33.9269 36.5899 56.1331 78.5538 94.4884 114.7332 137.2839 145.7906 181.4427 211.9045 244.6460 253.0451 295.6498 323.9261 358.4129 398.8355 444.5954 517.3627 567.2973 602.3812 606.5665 628.3912 704.5035 726.4799 757.4060 790.8023 826.6268 881.4747 907.0694 945.7975 970.4413 1004.0072 1016.7990 1030.4049 1051.6074 1083.7157 1091.0034 1105.9676 1110.4550 1121.7312 1139.6948 1204.8590 1224.8880 1236.6188 1264.1735 1274.9203 1288.1500 1288.5001 1290.3711 1315.7964 1322.4984 1336.0454 1350.7795 1355.0359 1365.9662 1380.4420 1448.9912 1450.1008 1455.3218 1458.7882 1467.1594 1480.9313 1484.8428 1494.6251 1612.8120 1639.4046 1644.6588 2938.5292 2946.5116 2956.7775 2976.5111 2979.0724 2985.7492 2986.8245 2988.4436 3010.9505 3027.8177 3040.1588 3048.9184 3058.8886 3073.2953 3450.2852 3453.3675 3558.3062 3577.8597 3579.1352
redmass: 3.9501 4.7494 3.0099 1.5907 3.3972 2.4756 3.2698 1.9138 2.7379 3.2856 1.2567 3.5988 1.0905 2.4633 2.5779 3.5359 3.3465 2.5824 2.0364 1.4251 2.1490 1.5916 1.3793 3.6657 1.1235 1.2922 1.2245 1.6679 1.8924 2.4110 1.8109 1.9690 3.1127 1.3230 2.2725 2.9435 2.9155 2.8680 3.2765 2.7522 1.5907 1.5810 1.5113 1.3727 1.3799 1.4139 1.3151 1.1680 1.2304 1.0550 1.3893 1.2918 1.1695 1.5284 1.3302 1.3532 1.3872 1.1111 1.1399 1.0843 1.0720 1.0918 1.1524 1.6813 1.0845 6.2104 1.0942 1.0888 1.0673 1.0583 1.0590 1.0622 1.0605 1.0610 1.0743 1.0871 1.1017 1.0927 1.1038 1.1032 1.1027 1.0990 1.0452 1.0446 1.0775 1.0971 1.0974
irintensity: 2.4057 1.9626 6.4304 3.3062 1.4907 7.4542 3.1309 0.1037 0.7661 1.0292 38.9671 40.2764 61.3507 5.4332 3.2501 14.6948 1.8922 14.2648 6.2895 163.3826 51.9437 260.3312 211.3396 0.5989 12.6313 2.3414 3.2958 10.5210 0.5312 2.5857 2.1805 5.0336 12.9319 5.8878 8.3789 3.8959 5.7071 20.2762 17.8001 18.4675 41.8952 1.3817 17.5167 15.8783 2.7733 3.2768 33.6749 3.8209 11.7968 0.4505 32.9626 28.5095 0.4152 0.3269 5.5945 4.0974 24.5410 30.1731 35.5904 2.2114 3.8123 0.2868 40.4175 188.6064 4.2992 171.4247 34.5575 33.1478 47.0777 12.5007 25.9314 9.4983 107.6343 14.2584 39.5215 10.5608 4.9268 17.4489 2.7168 163.3253 48.4526 8.3801 0.9662 1.1750 12.4571 0.3461 0.1671
temp: 298.150 k
press: 1.00000 atm
elementType: 8 7 7 7 6 6 6 6 6 6 6 6 1 1 1 1 1 1 1 1 1 1 1 1 1 1 1 1 1 1 1
symmnumber: 1
zpe: 720037.4 jmol-1
zpe.correction: 0.274248 hartree
zpe.thermalcorrener: 0.289969 hartree
zpe.thermalcorrenthalpy: 0.290913 hartree
zpe.thermalcorrgfe: 0.227824 hartree
zpe.sumelectzpe: -554.722819 hartree
zpe.sumelectthermal: -554.707097 hartree
zpe.sumelectthermalent: -554.706153 hartree
zpe.sumelectthermalfe: -554.769242 hartree
dipole: 0.5125 -0.6145 0.9509
dipole: 1.2428
quadrupole: -72.5294 -82.5821 -74.2248
quadrupole: 14.9190 -6.0261 8.3637
quadrupole: 3.9160 -6.1366 2.2206 14.9190 -6.0261 8.3637
hfenergy: -554.9970664 hartree
pointgroup: C01 [X(C8H19N3O1)]
dipole: -0.198092 0.1342303 0.4263956 debye
polarizability: 141.7734586|6.674388|103.023794|-3.2333094|2.652258|94.5363011 unknown
InChI: InChI=1S/C8H19N3O/c9-5-2-1-3-7-11-8(12)4-6-10/h11H,1-7,9-10H2
charge 0 multiplicity 1
31 atoms
O  2.285165 -0.986603 -1.426841
N  0.898828 -0.564729 0.397535
N  -5.752949 1.312199 0.026135
N  5.0572 1.866993 0.420277
C  -2.224779 -0.381758 0.374868
C  -1.343566 -1.285722 -0.515972
C  -3.568692 -0.001677 -0.288704
C  -0.003335 -1.700468 0.137026
C  -4.456952 0.906668 0.60535
C  1.982615 -0.272486 -0.419656
C  2.794654 0.96066 -0.018316
C  4.303322 0.635053 0.106347
H  -2.424776 -0.896864 1.338981
H  -1.67201 0.549073 0.622902
H  -1.127369 -0.775504 -1.47474
H  -1.903674 -2.210086 -0.765634
H  -4.133236 -0.924253 -0.540001
H  -3.373098 0.517762 -1.250139
H  0.546577 -2.38188 -0.535303
H  -0.195428 -2.231011 1.090695
H  -3.894222 1.825909 0.8622
H  -4.657802 0.389394 1.564328
H  0.703231 0.051599 1.187427
H  2.664018 1.721782 -0.813646
H  2.443783 1.409807 0.928924
H  4.619876 0.119776 -0.827203
H  4.452599 -0.078357 0.938481
H  -6.402124 0.534627 -0.130422
H  -5.671031 1.906699 -0.804798
H  5.050924 2.557089 -0.338831
H  6.006051 1.699807 0.768829
