program: Gaussian 09
title: 000184807
version: EM64L-G09RevD.01
frameworkgroup: C1[X(C14H18O2)]
method: RPBEPBE
basis: SDD
operation: Freq
keyword: #pfreq=noraman
keyword: PBEPBE/SDD
title: #p freq=noraman PBEPBE/SDD
converged: YES YES NO NO
title: Mulliken charges:
elementType: O O C C C C C C C C C C C C C C H H H H H H H H H H H H H H H H H H
charge: -0.232146 -0.259610 -0.147467 -0.438075 -0.448239 -0.394102 -0.399895 -0.386558 0.091881 0.194237 0.200311 -0.342550 -0.362843 -0.284539 -0.206625 -0.525130 0.222214 0.229296 0.204635 0.193824 0.229337 0.203230 0.189655 0.193104 0.203052 0.200798 0.194497 0.237326 0.255881 0.231870 0.233004 0.281472 0.208712 0.229442
chargesum: 0.00000
title: Mulliken charges with hydrogens summed into heavy atoms:
elementType: O O C C C C C C C C C C C C C C
charge: -0.232146 -0.259610 0.074747 -0.004143 -0.025078 -0.001216 -0.003739 0.008737 0.091881 0.194237 0.200311 -0.105224 -0.106962 -0.052670 0.026379 0.194496
polarizability: 1.99907267e+02 -7.91589393e+00 1.69787360e+02 -4.41317924e+00 5.71510192e+00 1.01178059e+02
1716.lowfreq: -14.3058 -0.0004 0.0003 0.0004 8.6460 11.8861 28.9668 45.9056 70.6286
frequency: 26.6820 45.7894 70.5147 106.6865 129.2831 170.0789 186.9810 209.3547 219.0516 228.5589 259.4175 279.9528 315.1003 345.7640 383.1432 423.4438 434.0294 470.3827 472.4979 505.1586 537.9423 568.8143 637.1025 699.2752 734.0857 755.1836 764.7195 781.8709 788.1441 815.5335 856.9185 864.9482 883.5035 895.3620 923.5758 948.7877 962.1709 979.5982 983.6419 1021.7057 1042.1024 1047.3766 1053.3915 1070.3345 1110.9284 1113.3448 1117.6057 1137.4808 1155.6637 1172.2468 1172.5205 1203.7326 1227.0904 1247.8063 1257.1691 1260.4878 1275.2501 1303.6233 1309.3411 1323.3587 1335.4341 1338.4939 1343.6848 1351.5252 1382.4409 1412.9517 1439.6289 1449.3579 1460.2890 1461.6841 1467.0204 1470.0464 1472.5262 1474.4227 1479.9610 1549.8043 1576.8424 1609.3936 2963.0383 2963.5586 2970.9593 2972.1210 2975.3959 2978.2148 2995.0355 3023.3094 3028.0807 3035.2360 3039.0369 3050.2080 3082.7721 3121.8872 3134.2766 3145.1647 3162.0977 3174.2857
redmass: 3.6365 3.8875 3.6884 3.1818 4.1428 3.3120 3.9274 3.4383 3.1893 1.7821 1.8503 3.4113 2.1317 2.6363 3.1135 3.5156 3.1634 3.8178 4.2556 1.6394 3.5745 4.8986 5.6648 4.7060 5.3124 2.1835 1.8560 2.2904 1.4924 4.4661 2.3107 1.4829 1.7070 1.5365 1.9501 1.4106 3.3995 7.0667 1.3293 2.7149 2.0110 1.6879 1.7821 1.2025 1.4826 1.9910 1.6015 2.2728 1.3305 1.0945 1.4112 2.1463 2.7084 1.6134 1.2748 1.3556 1.5507 1.3395 1.3948 1.3033 1.3687 1.5859 1.4970 1.4456 6.6397 1.7788 1.5760 1.0685 1.0880 1.0912 1.0963 1.5771 1.1153 1.2160 1.0945 5.8062 7.8378 6.1861 1.0619 1.0623 1.0628 1.0344 1.0606 1.0619 1.0838 1.0983 1.0944 1.1029 1.1028 1.1017 1.0978 1.1050 1.0851 1.0897 1.0947 1.0999
irintensity: 0.2455 0.8538 0.1723 4.3265 4.6306 1.0033 1.6248 5.4466 0.0509 0.2511 0.6600 3.2481 5.1738 2.2039 0.8599 3.3490 0.2568 5.9700 2.2452 2.4449 9.2165 4.5575 16.6731 7.9787 14.5993 46.4859 32.1398 7.3571 0.1045 2.6297 6.0674 5.0683 3.5590 10.7509 0.2065 5.9291 41.1447 47.1396 1.0096 5.6124 8.6142 2.3555 1.5636 0.1907 6.8073 0.2833 20.5734 4.2451 8.1006 4.9041 5.8557 86.1963 98.7186 45.5515 1.1480 6.0333 48.8015 27.6912 28.6867 7.9686 0.2217 9.4340 0.5520 2.2690 23.0284 21.7354 15.9215 19.5356 1.7926 12.8738 6.6834 32.5068 22.8358 81.5473 4.6977 84.7723 81.2385 54.8621 15.7751 49.1751 36.0902 33.0656 69.3222 10.4328 8.8374 75.1780 54.6114 29.1631 3.9542 110.8667 29.2109 23.1990 0.4051 14.1606 19.2686 15.1988
temp: 298.150 k
press: 1.00000 atm
elementType: 8 8 6 6 6 6 6 6 6 6 6 6 6 6 6 6 1 1 1 1 1 1 1 1 1 1 1 1 1 1 1 1 1 1
symmnumber: 1
zpe: 754698.9 jmol-1
zpe.correction: 0.287450 hartree
zpe.thermalcorrener: 0.302419 hartree
zpe.thermalcorrenthalpy: 0.303364 hartree
zpe.thermalcorrgfe: 0.244893 hartree
zpe.sumelectzpe: -693.515921 hartree
zpe.sumelectthermal: -693.500951 hartree
zpe.sumelectthermalent: -693.500007 hartree
zpe.sumelectthermalfe: -693.558477 hartree
dipole: -0.9462 -1.3803 -2.3717
dipole: 2.9027
quadrupole: -90.5895 -88.4244 -101.4844
quadrupole: -2.1837 -2.0470 -3.5676
quadrupole: 2.9099 5.0750 -7.9850 -2.1837 -2.0470 -3.5676
hfenergy: -693.8033701 hartree
pointgroup: C01 [X(C14H18O2)]
dipole: -0.3652443 -0.6121051 -0.8922691 debye
polarizability: 199.8362959|-8.5247401|170.4188198|-2.3326116|0.1075779|100.6175707 unknown
InChI: InChI=1S/C14H18O2/c1-16-13-10-6-5-9-12(13)14(15)11-7-3-2-4-8-11/h5-6,9-11H,2-4,7-8H2,1H3
charge 0 multiplicity 1
34 atoms
O  -0.132089 1.441712 1.12048
O  2.736764 1.789902 -0.049188
C  -1.425868 -0.107197 -0.219442
C  -2.257515 -0.747728 0.933862
C  -2.231581 1.048062 -0.883969
C  -3.643931 -1.222529 0.442059
C  -3.618397 0.568602 -1.370387
C  -4.432626 -0.069053 -0.220121
C  -0.100164 0.446383 0.329005
C  1.191359 -0.226003 -0.021714
C  2.473772 0.422059 -0.041695
C  1.173915 -1.650437 -0.158527
C  3.661434 -0.35793 -0.098565
C  2.348762 -2.414664 -0.23113
C  3.605064 -1.757645 -0.181366
C  1.751168 2.780124 -0.502869
H  -1.229365 -0.876166 -0.991556
H  -2.37871 0.011664 1.731215
H  -1.699705 -1.594672 1.38065
H  -1.65535 1.465979 -1.733789
H  -2.347469 1.859307 -0.139527
H  -4.216342 -1.639888 1.293192
H  -3.516271 -2.04581 -0.291763
H  -3.48982 -0.176397 -2.183273
H  -4.173742 1.422092 -1.805679
H  -5.406025 -0.437254 -0.597865
H  -4.653393 0.705619 0.542789
H  0.207753 -2.165241 -0.153307
H  4.615732 0.177506 -0.101467
H  2.293892 -3.504954 -0.310679
H  4.534378 -2.335821 -0.228084
H  1.064037 3.042591 0.317189
H  1.167669 2.391155 -1.360219
H  2.353467 3.646628 -0.817057
