program: Gaussian 09
title: 000186917
version: EM64L-G09RevD.01
frameworkgroup: C1[X(C16H22N2O5S)]
method: RPBEPBE
basis: SDD
operation: Freq
keyword: #p
keyword: freq=noraman
keyword: PBEPBE/SDD
title: #p freq=noraman PBEPBE/SDD
converged: YES YES NO NO
title: Mulliken charges:
elementType: S O O O O O N N C C C C C C C C C C C C C C C C H H H H H H H H H H H H H H H H H H H H H H
charge: 0.671037 -0.339607 -0.602768 -0.405266 -0.217710 -0.277735 -0.241280 -0.418526 -0.048029 -0.780815 -0.739565 0.298419 -0.068403 0.379602 -0.682569 -0.688498 -0.339119 -0.365759 0.195554 -0.204208 -0.200971 0.271245 -0.236252 -0.787597 0.225231 0.289900 0.315130 0.334723 0.275441 0.290848 0.217720 0.218038 0.261346 0.219043 0.216441 0.257728 0.383591 0.250569 0.251316 0.237349 0.237309 0.239718 0.225753 0.246770 0.251078 0.383778
chargesum: 0.00000
title: Mulliken charges with hydrogens summed into heavy atoms:
elementType: S O O O O O N N C C C C C C C C C C C C C C C C
charge: 0.671037 -0.339607 -0.602768 -0.021488 -0.217710 -0.277735 -0.241280 -0.034935 0.177202 -0.175785 -0.129401 0.298419 0.222444 0.379602 0.014534 0.004715 -0.088550 -0.114442 0.195554 0.033141 0.036339 0.271245 0.003466 -0.063996
polarizability: 3.10776380e+02 -1.41257036e+01 2.27818909e+02 -7.24695674e+00 -3.48788733e-01 1.76300530e+02
1716.lowfreq: -7.1078 -4.8739 -0.0021 -0.0020 -0.0006 2.9396 11.4678 14.2136 35.0970
frequency: 10.9984 14.1002 35.0653 40.6552 48.0186 53.0780 59.1337 63.4372 67.9595 77.6184 91.8814 103.1984 111.1624 138.8229 145.1996 158.8067 163.2212 194.1187 202.2383 215.9216 228.8700 249.3204 254.0363 262.6688 299.7477 301.4798 327.3918 353.3909 383.8886 393.0633 404.1163 408.2206 452.7015 474.1836 514.0304 529.8052 533.7956 550.5198 553.5100 597.5490 612.9537 620.4054 625.8086 658.9428 665.1322 698.9547 701.3989 739.9977 768.4292 794.2910 808.1424 828.2767 841.8477 847.4626 861.6534 874.5123 921.6081 923.9096 942.2977 943.4833 948.3196 970.5377 977.7933 985.5310 989.7435 999.8654 1025.7774 1026.9820 1045.4230 1073.7720 1080.0097 1091.7888 1133.9583 1137.1081 1144.1052 1175.3842 1176.9563 1179.6285 1183.6287 1185.8414 1225.2363 1257.5161 1274.5429 1302.9090 1303.9907 1319.5531 1323.0498 1324.5784 1342.9044 1374.5136 1376.0513 1384.8423 1387.5941 1401.6136 1416.9913 1419.5965 1440.6578 1453.7604 1457.2164 1465.0163 1468.7313 1478.8609 1479.9937 1495.2188 1517.0943 1553.0924 1590.8571 1606.4344 1612.3424 1657.2942 2989.9868 2994.2617 2996.7956 3006.3552 3024.1557 3044.9248 3061.7753 3080.0600 3085.2061 3095.5555 3103.4850 3112.9848 3119.4773 3134.1316 3137.8224 3141.3981 3149.4575 3153.4496 3158.3982 3173.7745 3331.0756 3522.1281
redmass: 5.9804 5.3013 4.5198 6.0438 5.2116 3.9849 2.9062 3.9863 2.6193 2.6226 5.6450 3.0580 3.8320 3.7233 4.8521 4.7543 5.5139 4.1856 1.3386 3.3137 1.1327 5.6538 5.7172 3.1698 4.3379 4.1013 3.3689 4.5080 3.9933 4.2031 3.3181 2.8769 3.2583 4.0681 4.3675 3.7561 4.0783 2.9384 2.6063 3.1664 5.5631 1.9874 3.3376 4.2435 5.7059 5.3163 2.0194 4.7237 1.8597 1.0907 6.7427 3.8747 2.2166 1.2498 2.8435 1.9354 1.3551 1.2665 3.0195 1.9842 2.9685 3.1982 1.4430 1.5747 5.9614 1.3223 1.9005 1.9498 1.6730 2.2744 1.5384 1.2494 2.3579 1.8943 2.3952 1.0571 1.8236 1.4476 1.1826 1.3913 1.2724 3.9030 1.5325 2.0978 1.7303 1.6768 1.4961 1.7164 1.3221 1.2197 6.3601 1.2385 1.3142 1.6127 1.1552 1.2049 2.2483 1.0469 1.0451 1.1076 1.0944 1.7972 1.2267 1.0955 2.1333 3.4026 6.3870 6.1564 4.1863 9.3153 1.0362 1.0374 1.0354 1.0840 1.0848 1.0556 1.0576 1.0999 1.0993 1.0979 1.1012 1.1000 1.0985 1.0856 1.0883 1.1107 1.0925 1.1083 1.0969 1.1017 1.0856 1.0641
irintensity: 0.9915 0.5140 0.1637 2.7601 2.4249 1.8508 0.4253 0.7680 1.0136 5.0226 2.5360 2.8350 1.4921 0.8780 10.5193 1.5240 10.9394 2.7516 1.9597 1.6897 0.2613 4.9872 14.9874 4.0802 2.9944 0.2297 1.2278 1.4430 6.2224 21.3135 7.1755 0.4770 2.0637 6.3264 15.5225 3.3322 2.8432 37.1679 84.4033 11.5933 2.8919 70.4341 13.4898 35.2872 6.9464 25.7350 41.8159 33.1442 35.1569 133.0450 40.4862 5.7427 35.0977 0.1994 1.3192 17.4137 5.2390 1.4660 6.1928 2.1991 18.3590 2.1206 0.4292 1.2209 3.0801 0.2368 19.1964 8.3515 4.5240 211.9549 19.2445 16.3457 14.6779 42.5771 8.9160 0.1793 1.2316 7.4260 2.5018 4.9726 1.5157 22.8647 18.7977 57.4969 142.4090 99.2020 16.4847 92.0123 7.0603 27.8413 4.1517 40.5680 76.6491 31.9675 5.4209 55.8950 11.0401 14.0981 0.7087 67.1582 42.3066 46.3052 22.9824 42.0481 519.8054 127.7558 4.6882 10.6761 139.0739 283.7670 28.8118 16.4258 10.9798 3.9958 16.0531 5.1234 0.4264 14.1093 45.9586 10.1076 25.4339 3.0944 24.1364 5.3579 0.2506 2.4279 13.5357 0.2639 20.2905 15.1503 636.2562 34.4367
temp: 298.150 k
press: 1.00000 atm
elementType: 16 8 8 8 8 8 7 7 6 6 6 6 6 6 6 6 6 6 6 6 6 6 6 6 1 1 1 1 1 1 1 1 1 1 1 1 1 1 1 1 1 1 1 1 1 1
symmnumber: 1
zpe: 948682.3 jmol-1
zpe.correction: 0.361334 hartree
zpe.thermalcorrener: 0.388036 hartree
zpe.thermalcorrenthalpy: 0.388980 hartree
zpe.thermalcorrgfe: 0.300363 hartree
zpe.sumelectzpe: -1504.718797 hartree
zpe.sumelectthermal: -1504.692095 hartree
zpe.sumelectthermalent: -1504.691150 hartree
zpe.sumelectthermalfe: -1504.779768 hartree
dipole: 9.8805 4.2866 3.5408
dipole: 11.3375
quadrupole: -156.9442 -161.8955 -143.7480
quadrupole: -5.5886 -16.2060 -10.7925
quadrupole: -2.7483 -7.6996 10.4479 -5.5886 -16.2060 -10.7925
hfenergy: -1505.0801309 hartree
pointgroup: C01 [X(C16H22N2O5S1)]
dipole: -4.2129343 1.1133297 -0.9527554 debye
polarizability: 301.9703053|21.4668356|231.5392422|-25.6785559|-8.1163288|181.3862715 unknown
InChI: InChI=1S/C16H22N2O5S/c1-11(2)18(13-7-5-4-6-8-13)15(20)10-24(23)9-14(16(21)22)17-12(3)19/h4-8,11,14,17,21H,9-10H2,1-3H3
charge 0 multiplicity 1
46 atoms
S  1.058522 -1.825544 0.836402
O  0.007954 0.657924 -0.841091
O  1.042484 -3.461876 1.153815
O  4.448619 -0.052821 -2.456122
O  5.552496 -1.5736 -1.085327
O  4.81895 1.716851 0.22756
N  -2.157916 0.35207 -0.028673
N  2.815887 0.727382 -0.367862
C  -2.44775 1.840573 -0.019649
C  -0.613246 -1.595467 -0.232789
C  2.361827 -1.672592 -0.627428
C  -0.915549 -0.124861 -0.411548
C  3.415449 -0.601613 -0.309731
C  -3.269472 -0.534511 0.258748
C  -2.442647 2.419601 -1.452709
C  -1.514219 2.604615 0.943727
C  -3.751216 -1.422847 -0.734529
C  -3.90102 -0.479632 1.525949
C  4.601389 -0.790738 -1.281014
C  -4.849365 -2.265245 -0.452414
C  -5.005028 -1.316301 1.797387
C  3.590479 1.834288 -0.081964
C  -5.480201 -2.213375 0.811812
C  2.885525 3.181407 -0.170052
H  -3.479504 1.908793 0.371841
H  -0.383376 -2.102999 -1.1821
H  -1.338847 -2.178212 0.350523
H  2.781252 -2.690715 -0.657266
H  1.802733 -1.427965 -1.543745
H  3.862875 -0.780832 0.688292
H  -2.767393 3.475531 -1.422289
H  -3.142121 1.865786 -2.104617
H  -1.433103 2.373481 -1.890327
H  -1.837795 3.65956 1.001582
H  -1.552232 2.17702 1.961777
H  -0.471894 2.578722 0.590288
H  1.827028 0.811777 -0.656452
H  -3.274113 -1.441937 -1.7208
H  -3.516735 0.199075 2.295291
H  -5.215698 -2.953215 -1.221756
H  -5.485354 -1.276931 2.780815
H  -6.333359 -2.864955 1.02756
H  1.812342 3.089813 -0.409039
H  3.00328 3.716195 0.788145
H  3.374781 3.792825 -0.9483
H  5.249082 -0.193206 -3.030526
