program: Gaussian 09
title: 000186865
version: EM64L-G09RevD.01
frameworkgroup: C1[X(C5H6N4O5)]
method: RPBEPBE
basis: SDD
operation: Freq
keyword: #pfreq=noraman
keyword: PBEPBE/SDD
title: #p freq=noraman PBEPBE/SDD
converged: YES YES NO NO
title: Mulliken charges:
elementType: O O O O O N N N N C C C C C H H H H H H
charge: -0.433646 -0.166521 -0.259174 -0.201757 -0.258767 -0.375232 -0.395768 -0.383169 -0.619874 0.029161 0.160073 0.234882 0.199816 0.250649 0.348651 0.365552 0.378230 0.395002 0.347695 0.384197
chargesum: 0.00000
title: Mulliken charges with hydrogens summed into heavy atoms:
elementType: O O O O O N N N N C C C C C
charge: -0.055416 -0.166521 -0.259174 -0.201757 -0.258767 -0.026581 -0.030216 0.011833 0.112018 0.029161 0.160073 0.234882 0.199816 0.250649
polarizability: 1.33457576e+02 1.78861261e+01 9.22829155e+01 3.14717647e+00 2.11694194e+00 6.73790813e+01
1716.lowfreq: -11.2644 -7.7608 -0.0009 -0.0007 -0.0001 2.0360 27.3934 54.6713 75.8090
frequency: 27.0224 54.6608 75.7716 127.0706 146.1028 171.8306 181.0085 251.9484 277.4390 310.9889 323.1115 372.3742 393.8212 432.4517 527.3652 532.4497 556.6355 564.9382 587.8150 603.6722 642.1278 675.7787 683.1891 703.7214 725.1213 740.2339 772.3126 797.5108 811.5480 905.1265 954.4982 968.3506 1036.9260 1101.5163 1126.4015 1159.9678 1203.7001 1285.0944 1299.5238 1318.9936 1348.3394 1375.9616 1456.0807 1564.7065 1634.2824 1695.4227 1696.4632 1737.2720 3410.1195 3492.9380 3572.1341 3583.7949 3590.6618 3653.5913
redmass: 11.1619 9.2605 5.2929 10.0627 6.3735 6.9031 6.8974 3.1206 5.3806 3.8908 1.9501 6.4714 9.5956 5.5278 3.0170 2.6123 4.2400 1.8320 1.4406 9.3405 1.5145 4.4535 4.7617 2.7008 5.4486 1.5725 3.1984 1.5711 4.4953 5.7679 3.9742 3.3395 9.5867 2.1827 4.2623 2.0556 5.0167 1.9686 3.4333 1.7555 3.0228 1.5822 2.2577 1.6726 2.9080 8.1174 7.2568 9.7406 1.0571 1.0773 1.0668 1.0802 1.0802 1.0951
irintensity: 0.1837 0.5182 1.4158 11.4349 5.6419 0.3990 2.4083 16.8244 2.9494 32.5081 78.6542 27.6617 4.5996 3.5858 4.9393 27.6675 12.7863 131.8584 105.0987 1.6311 75.2339 29.9759 36.9868 6.3331 136.3527 145.5414 24.8478 84.4113 50.2822 22.8991 61.8412 52.2614 83.7100 23.9075 28.2540 86.1352 122.8497 81.4924 273.5155 11.9455 319.4340 41.3229 208.0653 307.2792 66.0986 152.3867 910.9318 286.0145 96.1484 102.0276 23.6722 97.2190 53.3989 97.6732
temp: 298.150 k
press: 1.00000 atm
elementType: 8 8 8 8 8 7 7 7 7 6 6 6 6 6 1 1 1 1 1 1
symmnumber: 1
zpe: 354345.2 jmol-1
zpe.correction: 0.134963 hartree
zpe.thermalcorrener: 0.147834 hartree
zpe.thermalcorrenthalpy: 0.148779 hartree
zpe.thermalcorrgfe: 0.094648 hartree
zpe.sumelectzpe: -788.290060 hartree
zpe.sumelectthermal: -788.277188 hartree
zpe.sumelectthermalent: -788.276244 hartree
zpe.sumelectthermalfe: -788.330375 hartree
dipole: -1.8851 -0.3665 0.9754
dipole: 2.1538
quadrupole: -94.1357 -82.8546 -75.9866
quadrupole: -20.3914 -3.3076 4.3489
quadrupole: -9.8100 1.4710 8.3390 -20.3914 -3.3076 4.3489
hfenergy: -788.4250227 hartree
pointgroup: C01 [X(C5H6N4O5)]
dipole: -0.7254832 -0.4265485 0.0989921 debye
dipolederiv: -0.3752948 -0.0907792 -0.0121528 -0.1509862 -0.4821624 0.0352785 -0.1475484 -0.0295189 -0.8733072 -0.4872127 -0.146658 -0.0860228 -0.1282402 -1.0367223 -0.1384897 -0.1251277 -0.0912141 -0.3539996 -0.7206924 0.0271723 0.0758483 -0.0856646 -0.4202269 -0.1921171 -0.0727642 -0.2720156 -0.8170368 -0.9713524 -0.2790823 -0.3465612 -0.3709153 -0.7094021 -0.1849485 -0.3927063 -0.1509427 -0.5487437 -0.9880161 -0.1772431 -0.3238469 -0.1555088 -0.4689349 -0.1968441 -0.2073893 -0.1724262 -0.7873512 -1.0381875 0.020342 -0.3762007 -0.0618781 -0.4768774 0.0109962 -0.2922847 0.1662699 -0.7933744 -0.8303515 -0.4836148 -0.2214089 -0.2453947 -1.1348308 -0.0931132 -0.2942341 -0.2494711 -0.4451234 -1.7959744 -0.2280014 -0.3170497 -0.2176476 -0.3222993 -0.1328942 -0.0049549 -0.0892657 -0.5025935 -0.6042508 0.0959668 0.1561379 0.0967805 -0.6981427 -0.0898223 0.2074719 -0.0954862 -0.9741652 0.2812621 0.3459226 0.1226153 0.6673164 0.2348576 0.1985649 0.1904998 0.1013933 0.9109626 1.0415365 0.4675677 0.3942858 0.0060341 1.2788479 0.2025487 0.639138 0.2727062 0.3357123 1.3671714 0.004612 0.199175 0.2109333 0.3061581 0.3450642 0.1744764 0.4384534 0.9290947 1.5326506 0.2258802 0.7344782 0.3372008 1.6277981 0.0539246 0.7685189 0.0245376 0.775212 2.0938699 0.2555412 0.2217611 0.1135745 0.5084017 0.4150948 -0.2958325 0.363779 1.354027 0.2189726 0.0173056 -0.0851406 0.0021174 0.2330543 -0.0263403 -0.0973089 -0.0732047 0.3166847 0.267246 -0.0212745 -0.0678508 -0.0757624 0.1911932 -0.0269868 -0.074128 -0.0133247 0.3314915 0.0721969 0.0612051 0.0511112 0.0662725 0.3563581 -0.0356318 0.0445962 -0.0133968 0.3481272 0.2980745 -0.0253941 -0.0426755 0.0166041 0.2943622 -0.0263857 -0.0125775 -0.016124 0.2967986 0.1832427 -0.0394424 -0.0238415 -0.0370146 0.3629827 -0.0570094 -0.0183647 -0.0544105 0.2509163 0.4551093 -0.0300257 -0.0526613 0.0121789 0.355585 -0.0608887 0.0105201 -0.0463382 0.2466681 unknown
polarizability: 127.6566762|13.5011641|80.5924072|18.8008966|15.3252682|84.8704895 unknown
InChI: InChI=1S/C5H6N4O5/c6-3(12)7-1(10)5(14)2(11)8-4(13)9-5/h7-9,14H,6H2
charge 0 multiplicity 1
20 atoms
O  -0.294667 0.170597 2.041691
O  -0.917475 2.603031 0.312873
O  0.936718 -0.482487 -1.245239
O  -3.435049 -1.10603 -1.14643
O  4.122331 0.933184 1.195349
N  -1.46869 -0.919087 0.188637
N  -2.401351 0.976661 -0.591924
N  1.89835 0.434605 0.698168
N  3.598286 0.049156 -0.915365
C  -0.548282 0.122279 0.610031
C  -1.281024 1.429168 0.096461
C  0.851311 -0.015199 -0.069044
C  -2.535925 -0.451274 -0.584454
C  3.301958 0.493388 0.347688
H  -1.222828 -1.908711 0.18418
H  -3.081623 1.579521 -1.056282
H  -1.122306 0.396866 2.536602
H  1.677776 0.750943 1.650371
H  4.572564 0.081746 -1.207006
H  2.853424 -0.297861 -1.532409
