program: Gaussian 09
title: 000186868
version: EM64L-G09RevD.01
frameworkgroup: C1[X(C11H7ClO3)]
method: RPBEPBE
basis: SDD
operation: Freq
keyword: #p
keyword: freq=noraman
keyword: PBEPBE/SDD
title: #p freq=noraman PBEPBE/SDD
converged: NO YES NO NO
title: Mulliken charges:
elementType: Cl O O O C C C C C C C C C C C H H H H H H H
charge: -0.028162 -0.213214 -0.170901 -0.154759 0.038887 0.131610 0.380711 0.140515 0.103685 -0.355625 -0.354797 -0.799642 -0.224289 -0.217629 -0.116304 0.252555 0.247932 0.274313 0.253768 0.285029 0.262215 0.264103
chargesum: 0.00000
title: Mulliken charges with hydrogens summed into heavy atoms:
elementType: Cl O O O C C C C C C C C C C C
charge: -0.028162 -0.213214 -0.170901 -0.154759 0.038887 0.131610 0.380711 0.140515 0.103685 -0.101858 -0.069768 -0.024843 0.037925 0.046474 -0.116304
polarizability: 2.59198121e+02 2.14204326e+01 1.37709603e+02 -1.40572531e+00 5.87669570e+00 6.02177420e+01
1716.lowfreq: -7.8562 -2.9273 -0.0012 0.0007 0.0008 4.0586 36.5110 51.8651 84.0602
frequency: 36.4402 51.8597 84.0582 124.9364 156.6895 188.6955 199.4980 229.8605 256.2411 287.7177 325.2300 349.8780 381.8767 408.2176 455.7951 460.1290 538.4870 562.7475 614.3065 623.3019 666.8276 684.1433 703.0645 716.9557 751.6221 793.7357 826.1886 834.5092 842.9639 958.7936 972.3328 974.3252 1000.3608 1024.1233 1034.4206 1078.8835 1114.2080 1128.9954 1202.4435 1228.2037 1306.1956 1327.5594 1362.6513 1400.5887 1406.4528 1460.9509 1470.7461 1482.8365 1563.3604 1597.3420 1624.1687 1667.6559 1730.0028 2977.9756 3059.3619 3101.0254 3164.5058 3168.2495 3185.3161 3188.9206
redmass: 3.5546 9.8686 6.9127 6.0765 13.6398 1.1981 4.7457 8.5052 6.4013 3.8646 5.3813 5.6017 9.0982 2.9170 4.4827 8.4939 3.9878 7.2431 12.1204 7.4032 6.4567 7.7687 7.7870 4.3271 5.5046 11.1197 1.2952 3.5065 1.7463 1.3516 3.2036 1.6603 4.1136 1.7777 1.9493 2.7391 3.0995 1.6373 1.1463 4.8310 1.3164 3.8027 5.4821 1.2364 3.5393 1.0829 1.0704 2.3938 6.9562 5.9878 9.5815 12.7813 12.6934 1.0404 1.0927 1.0998 1.0889 1.0897 1.0954 1.0971
irintensity: 0.4298 2.9899 0.9463 1.7619 2.5383 0.6033 0.6668 0.3355 0.6292 1.6942 0.3602 2.0255 15.2008 0.1810 6.1943 24.6346 27.1761 6.8929 1.8736 0.3345 2.3762 15.0279 12.7675 0.5766 2.5352 81.9376 10.5792 10.3757 64.3677 0.2354 59.6193 11.9902 22.5841 4.9342 8.7553 99.7731 119.4239 37.2596 2.7827 89.2372 7.7909 66.4244 23.2033 31.4957 15.3388 30.2138 16.6263 63.1010 4.0230 151.7745 116.1678 491.3900 116.7353 4.5541 8.5058 3.9741 1.0566 0.8967 3.6093 3.2804
temp: 298.150 k
press: 1.00000 atm
elementType: 17 8 8 8 6 6 6 6 6 6 6 6 6 6 6 1 1 1 1 1 1 1
symmnumber: 1
zpe: 395479.0 jmol-1
zpe.correction: 0.150630 hartree
zpe.thermalcorrener: 0.163636 hartree
zpe.thermalcorrenthalpy: 0.164580 hartree
zpe.thermalcorrgfe: 0.109922 hartree
zpe.sumelectzpe: -1108.060343 hartree
zpe.sumelectthermal: -1108.047338 hartree
zpe.sumelectthermalent: -1108.046393 hartree
zpe.sumelectthermalfe: -1108.101051 hartree
dipole: 3.5095 -3.6589 0.3507
dipole: 5.0820
quadrupole: -120.3318 -90.6945 -92.2646
quadrupole: 6.9200 -0.4253 3.9383
quadrupole: -19.2348 10.4024 8.8324 6.9200 -0.4253 3.9383
hfenergy: -1108.2109732 hartree
pointgroup: C01[X(C11H7Cl1O3)]
dipole: 1.3801475 -1.2583194 -0.7138026 debye
dipolederiv: -1.0823335 -0.0182909 0.0383909 0.0264789 -0.0749973 -0.029421 0.0568205 -0.0261497 -0.0865671 -0.8903222 -0.2116249 -0.0546768 0.0313835 -0.8269956 -0.2908427 0.0732522 -0.3021931 -0.3499195 -0.5428934 -0.0898594 -0.01713 -0.1039928 -0.8416406 -0.254041 -0.0897507 -0.2640653 -0.4166306 -1.3134401 -0.3289847 -0.099652 -0.2715611 -0.5314667 -0.092433 -0.0359764 -0.0884901 -0.3390788 0.9921328 0.1508207 0.0108815 0.1439034 -0.3458785 -0.1850176 0.0799767 -0.1853909 -0.1181237 -1.2145394 -0.0624468 0.0446323 0.1043423 0.3121041 0.1639725 0.083909 0.1930938 0.050901 -0.5514782 -0.0582938 -0.0012364 0.1457795 -0.0245681 -0.0284925 0.0696822 -0.0226078 -0.0027499 1.0336452 0.153104 0.0086926 0.1181286 1.1683656 0.403282 0.0958785 0.432846 0.4975138 2.1447412 0.410137 0.0903354 -0.0802705 0.9478679 0.3254842 -0.2235701 0.3053726 0.4471854 0.2802812 0.0533384 0.0470908 -0.2510015 -0.0971914 0.0755877 -0.169182 0.0603301 -0.0233942 0.279775 -0.0366843 -0.0707417 0.2120567 -0.0236336 0.0815133 0.1205752 0.0590488 -0.0408648 0.0442292 0.0816451 0.0349102 -0.0030206 -0.1463548 -0.1096521 -0.0906022 -0.1806234 -0.0335101 -0.6002083 -0.0926533 -0.074569 -0.1709538 -0.0748174 0.0494235 -0.2051101 0.0317806 -0.0362883 -0.493116 0.0891202 0.1307958 0.1939316 -0.0483816 0.0416117 0.2569223 0.0568387 -0.0539279 1.5524065 0.0063677 -0.0631306 -0.009434 0.0524012 0.1188835 -0.0452753 0.1218682 0.0878697 -0.0085043 0.0860393 -0.0638489 0.0308544 0.040887 -0.0042847 -0.0415164 0.0314316 0.0714903 0.124919 0.011812 0.0555258 -0.0423117 0.0556367 0.0269934 0.0211061 0.0031936 -0.0676735 -0.0057253 -0.1169901 0.012995 -0.0352348 0.0681564 -0.0010032 0.0584477 0.0410465 0.1260548 0.03916 -0.0452435 -0.0735706 -0.0249556 0.0794512 -0.0763132 -0.0490308 -0.0740928 0.0477716 0.1251198 0.0314802 0.0471182 -0.0096676 0.1092731 -0.0632953 0.0353714 -0.0407863 0.093246 0.0487076 0.0283128 0.0422677 0.0431546 0.1012122 -0.0803034 0.0391931 -0.0806929 0.064974 0.0374434 -0.0411058 -0.0450803 -0.0476096 0.1005702 -0.071652 -0.0411208 -0.0717582 0.0817217 unknown
polarizability: 258.7673509|23.7804619|111.113444|2.101224|36.7848281|87.2446705 unknown
InChI: InChI=1S/C11H7ClO3/c1-6-9(11(14)15-10(6)13)7-2-4-8(12)5-3-7/h2-5H,1H3
charge 0 multiplicity 1
22 atoms
Cl 5.255098 -0.108037 -0.112075
O  -3.011698 0.87814 0.811726
O  -1.193581 2.220205 1.386844
O  -4.249172 -0.943776 -0.008653
C  -0.84686 0.018358 0.247311
C  -1.779214 -0.917411 -0.163729
C  0.618887 -0.000288 0.150221
C  -1.601248 1.167647 0.880057
C  -3.144931 -0.414933 0.17354
C  1.281784 -0.80997 -0.820598
C  1.420373 0.791374 1.027864
C  -1.631668 -2.267076 -0.8000
C  2.685945 -0.843923 -0.907576
C  2.826082 0.757727 0.955012
C  3.442729 -0.062795 -0.010427
H  -0.764716 -2.817592 -0.394843
H  -1.495959 -2.186793 -1.896385
H  -2.547426 -2.858715 -0.634527
H  0.701893 -1.391427 -1.541188
H  0.94068 1.440725 1.763999
H  3.183888 -1.458454 -1.662669
H  3.431513 1.362315 1.635896
