program: Gaussian 09
title: 000184806
version: EM64L-G09RevD.01
frameworkgroup: C1[X(C8H15NO4)]
method: RPBEPBE
basis: SDD
operation: Freq
keyword: #p
keyword: freq=noraman
keyword: PBEPBE/SDD
title: #p freq=noraman PBEPBE/SDD
converged: NO YES NO NO
title: Mulliken charges:
elementType: O O O O N C C C C C C C C H H H H H H H H H H H H H H H
charge: -0.456705 -0.426735 -0.447631 -0.461492 -0.191303 -0.135417 -0.083976 -0.139534 -0.389123 -0.441912 -0.171710 -0.493206 -0.154093 0.239627 0.220952 0.271448 0.207246 0.233934 0.244559 0.203461 0.246437 0.251673 0.230335 0.250295 0.360043 0.329855 0.358340 0.344631
chargesum: 0.00000
title: Mulliken charges with hydrogens summed into heavy atoms:
elementType: O O O O N C C C C C C C C
charge: -0.096662 -0.096879 -0.089291 -0.116860 -0.191303 0.104210 0.136976 0.131914 0.052057 0.006108 0.074727 -0.011198 0.096202
polarizability: 1.13915699e+02 -1.71076591e+00 1.00247111e+02 -2.36351553e+00 4.95744399e-01 8.91022240e+01
1716.lowfreq: -13.2774 -8.1566 -0.0007 -0.0006 -0.0005 9.9611 73.6240 85.3175 105.3717
frequency: 73.5999 85.3048 105.3455 134.0378 179.9212 198.3389 227.7395 271.9646 309.4179 345.2003 370.6467 386.4399 415.2225 420.8083 434.9616 462.1461 507.2612 533.2741 582.0723 594.6413 630.4905 729.0305 750.4332 793.0186 823.4528 834.1537 873.0980 893.0242 924.9384 963.1386 979.3102 1006.8530 1022.2876 1030.7731 1036.9454 1063.2999 1082.4747 1098.2701 1146.8934 1155.1428 1169.9423 1179.2744 1194.2020 1211.0368 1218.3846 1236.3033 1252.3786 1258.1936 1260.7873 1283.1973 1298.1132 1303.8496 1318.2717 1327.1121 1352.1956 1361.1644 1367.3907 1376.7925 1383.8929 1410.6202 1459.6815 1464.9619 1492.3771 2881.7086 2886.7138 2914.4775 2972.0736 3026.0935 3039.6002 3042.0466 3046.1803 3068.7253 3094.2189 3117.7220 3443.6014 3483.8108 3503.7801 3546.8270
redmass: 4.0840 4.8422 2.7177 3.8700 4.9391 4.5062 5.6816 4.6232 3.5828 3.1941 3.0313 2.3773 1.2076 1.7257 2.3000 2.8875 1.1558 3.1983 1.6118 2.0756 3.1611 3.8067 4.1542 1.9577 3.7414 2.6853 2.4288 2.4001 2.8418 2.6188 2.3666 2.3189 4.2162 2.7777 2.6972 2.3440 2.1854 1.7258 2.0385 2.0115 1.6186 1.2163 1.4499 1.4961 1.2472 1.3679 1.6120 1.3632 1.3999 1.3790 1.3302 1.4570 1.3902 1.4058 1.4119 1.2801 1.3394 1.1930 1.2537 1.7931 1.0862 1.0844 1.0900 1.0723 1.0781 1.0704 1.0828 1.0622 1.0852 1.0928 1.0902 1.0880 1.1029 1.0897 1.0646 1.0648 1.0648 1.0655
irintensity: 2.7837 3.1323 1.5559 1.6114 5.0497 7.4447 7.9141 9.9438 17.1787 1.1709 4.5239 5.5632 138.6200 18.4228 34.0631 2.8231 113.0772 9.6074 106.7685 84.7465 40.6242 6.6393 12.6555 2.7343 38.1240 35.2354 12.2230 15.1182 3.3191 28.6104 7.0299 69.9432 58.8123 20.6697 31.0115 39.6386 45.0464 62.0517 16.2392 31.6613 40.0631 19.7208 35.6892 32.8248 17.9818 17.3224 14.2010 19.4814 10.1293 4.9680 12.2268 5.6361 6.7924 1.8385 6.6092 20.8458 20.5126 70.1255 19.2450 7.7127 13.0234 6.1392 7.8569 36.4205 57.3355 93.8784 27.6357 30.7077 17.1749 24.9470 29.0546 39.7430 18.8512 19.2025 26.1377 20.7248 0.7092 14.8144
temp: 298.150 k
press: 1.00000 atm
elementType: 8 8 8 8 7 6 6 6 6 6 6 6 6 1 1 1 1 1 1 1 1 1 1 1 1 1 1 1
symmnumber: 1
zpe: 614420.4 jmol-1
zpe.correction: 0.234020 hartree
zpe.thermalcorrener: 0.246558 hartree
zpe.thermalcorrenthalpy: 0.247503 hartree
zpe.thermalcorrgfe: 0.196054 hartree
zpe.sumelectzpe: -668.412119 hartree
zpe.sumelectthermal: -668.399581 hartree
zpe.sumelectthermalent: -668.398637 hartree
zpe.sumelectthermalfe: -668.450085 hartree
dipole: 2.1354 -3.2951 -1.6341
dipole: 4.2530
quadrupole: -82.6501 -82.1950 -78.0309
quadrupole: -5.3640 -2.7024 1.8388
quadrupole: -1.6915 -1.2363 2.9278 -5.3640 -2.7024 1.8388
hfenergy: -668.6461391 hartree
pointgroup: C01 [X(C8H15N1O4)]
dipole: -0.7720781 -1.3941525 0.5099257 debye
polarizability: 113.7508352|2.8427922|100.6158411|-0.7056902|0.2413716|88.8983579 unknown
InChI: InChI=1S/C8H15NO4/c10-4-1-2-9-3-5(11)7(12)8(13)6(4)9/h4-8,10-13H,1-3H2
charge 0 multiplicity 1
28 atoms
O  0.595699 2.315797 1.001639
O  -1.745492 1.095241 -1.502612
O  3.080109 0.864739 0.203798
O  1.921391 -1.272418 -1.248377
N  -0.638674 -1.092905 0.079999
C  -0.677982 0.309823 0.606435
C  0.624301 1.042968 0.277282
C  -1.968331 0.824744 -0.07445
C  -2.023419 -1.628704 0.26457
C  0.45917 -1.904068 0.649674
C  1.860002 0.216346 0.708357
C  -2.945048 -0.372078 0.130136
C  1.788213 -1.250278 0.225676
H  -0.816141 0.326957 1.716151
H  0.677007 1.224914 -0.817663
H  -2.324318 1.776484 0.342359
H  -2.137078 -2.085536 1.274463
H  -2.235593 -2.409336 -0.486597
H  0.403538 -2.930323 0.244513
H  0.399631 -1.965921 1.764288
H  1.947221 0.25467 1.809859
H  -3.639129 -0.433582 -0.723688
H  -3.545511 -0.231892 1.045682
H  2.656592 -1.813209 0.606033
H  1.469263 2.760077 0.846399
H  -1.341562 0.270091 -1.883734
H  3.178595 0.560464 -0.739996
H  0.994545 -1.146866 -1.596996
