program: Gaussian 09
title: 000184805
version: EM64L-G09RevD.01
frameworkgroup: C1[X(C12H4Br2Cl2O2)]
method: RPBEPBE
basis: SDD
operation: Freq
keyword: #p
keyword: freq=noraman
keyword: PBEPBE/SDD
title: #p freq=noraman PBEPBE/SDD
converged: NO NO NO NO
title: Mulliken charges:
elementType: Br Br Cl Cl O O C C C C C C C C C C C C H H H H
charge: 0.114783 0.114259 0.053943 0.053287 -0.267540 -0.255152 0.477791 0.443963 0.254819 0.247952 -0.450144 -0.331690 -0.224249 -0.088836 -0.356904 -0.357293 -0.222792 -0.220501 0.266907 0.267341 0.239880 0.240173
chargesum: 0.00000
title: Mulliken charges with hydrogens summed into heavy atoms:
elementType: Br Br Cl Cl O O C C C C C C C C C C C C
charge: 0.114783 0.114259 0.053943 0.053287 -0.267540 -0.255152 0.477791 0.443963 0.254819 0.247952 -0.450144 -0.331690 -0.224249 -0.088836 -0.089997 -0.089952 0.017088 0.019672
polarizability: 3.01214137e+02 5.04819709e+00 2.25880814e+02 -1.61224003e-03 1.85747075e-03 6.55076345e+01
1716.lowfreq: -6.3498 -4.6116 0.0009 0.0015 0.0016 2.7105 26.9266 52.3862 62.1927
frequency: 26.9215 52.3861 62.1910 81.5775 110.1766 136.0333 163.1999 165.8193 201.6585 205.0093 220.4036 251.9048 270.7941 294.2684 317.3213 318.4744 345.5529 445.2717 499.9879 503.1933 523.2362 535.0524 560.6103 584.8906 592.2485 610.9096 681.8041 682.5273 731.2030 738.7787 760.9135 777.7195 844.1159 853.9652 901.2093 919.0533 936.6769 976.0601 1024.2707 1078.1821 1117.4148 1151.4845 1165.7424 1203.5395 1251.0329 1268.8405 1335.1157 1342.4546 1377.0095 1403.5788 1443.8843 1475.7793 1538.4658 1554.2892 1610.8749 1622.0305 3148.6460 3160.4879 3170.9303 3182.7657
redmass: 10.4359 22.4408 9.8147 8.3680 10.6005 49.1998 12.8847 24.7853 8.2099 34.6702 23.3408 13.9759 5.5530 11.0011 14.6628 12.1703 12.4191 3.1577 11.6609 11.9134 4.5489 8.6230 9.9448 11.6190 11.9770 11.7671 4.3047 8.3446 11.3572 9.6009 1.2266 9.3848 8.0697 1.3467 11.6254 11.5004 1.3661 1.3027 2.0072 3.2522 11.2915 1.9023 1.0987 4.6133 5.4992 1.5306 10.9699 9.4271 10.2471 10.2508 2.4810 2.9410 11.3426 9.9901 8.0271 8.1078 1.0861 1.0904 1.0951 1.1009
irintensity: 0.8627 0.2588 0.1611 0.0271 0.5946 0.3319 0.0032 0.0628 0.0095 0.0693 0.3076 0.3826 0.2770 1.5289 0.1616 0.2663 2.4448 5.4461 2.8120 1.4658 0.0013 0.8333 3.4653 0.3596 3.1161 24.5445 0.0000 1.7070 0.0007 29.0977 110.7169 62.0645 22.1094 0.0001 94.1337 6.2844 5.6401 0.0000 16.7659 16.7291 15.5744 0.3045 9.9911 93.3858 117.0375 3.9960 208.1910 118.7199 287.5345 311.4559 13.6989 272.6176 12.9273 0.6347 16.3377 0.3372 1.8264 10.8667 3.3825 10.4656
temp: 298.150 k
press: 1.00000 atm
elementType: 35 35 17 17 8 8 6 6 6 6 6 6 6 6 6 6 6 6 1 1 1 1
symmnumber: 1
zpe: 326041.8 jmol-1
zpe.correction: 0.124183 hartree
zpe.thermalcorrener: 0.140056 hartree
zpe.thermalcorrenthalpy: 0.141000 hartree
zpe.thermalcorrgfe: 0.078113 hartree
zpe.sumelectzpe: -1555.879010 hartree
zpe.sumelectthermal: -1555.863137 hartree
zpe.sumelectthermalent: -1555.862192 hartree
zpe.sumelectthermalfe: -1555.925079 hartree
dipole: -3.5135 -0.9988 -0.0002
dipole: 3.6527
quadrupole: -112.6383 -132.9003 -137.7317
quadrupole: 0.3641 0.0010 0.0002
quadrupole: 15.1185 -5.1435 -9.9749 0.3641 0.0010 0.0002
hfenergy: -1556.0031925 hartree
pointgroup: C01 [X(C12H4Br2Cl2O2)]
dipole: 1.4271918 -0.1683356 0.0000909 debye
dipolederiv: 0.0816605 0.0515995 -0.000002 0.0015119 -0.5241092 0.000003 -0.0000014 0.0000086 0.0513512 -0.4587271 -0.2531145 0.0000218 -0.2909008 -0.0510956 0.0000135 0.0000272 0.0000148 0.0475914 -0.0083272 -0.0398649 0.0000013 0.0068486 -0.6608288 0.000011 0.0000015 0.000002 0.0132955 -0.5182501 0.3054346 0.0000166 0.3391177 -0.2121345 -0.0000115 0.0000237 -0.0000146 0.0067237 -2.0923315 -0.0133595 -0.000008 0.0907994 -0.2816596 -0.0000153 0.0000035 -0.0000399 -0.1316528 -2.1028284 -0.0868028 -0.0000068 -0.08253 -0.3305377 0.0000211 0.0000076 0.0000442 -0.1296326 1.2526448 -0.0685 -0.0000409 -1.0140848 -0.1660754 0.0000144 -0.0000537 0.0000144 0.1281216 1.2453552 0.1317712 -0.0000391 1.0052397 -0.0191974 -0.0000097 -0.0000701 -0.0000109 0.1214047 1.2413491 0.1614828 0.0000539 0.8737344 0.11151 0.000019 0.0000586 0.0000226 0.067333 1.2376089 -0.1127283 0.0000518 -0.8966319 0.0880306 -0.0000214 0.0000673 -0.0000191 0.0683629 -0.398499 -0.0449403 0.0000033 -0.1775951 0.9432244 0.0000063 0.0000156 -0.000011 -0.1359376 -0.2433225 0.0924439 -0.0000034 0.0894061 0.9508447 -0.0000248 0.0000053 -0.0000121 -0.0845728 0.6357363 0.4315721 -0.0000353 0.6656157 -0.1018261 -0.0000324 -0.0000474 -0.0000236 -0.0735033 0.5027565 -0.5364687 -0.0000168 -0.6123673 0.0660221 0.000028 -0.0000295 0.0000279 -0.0149367 -0.2607503 -0.0334411 0.0000061 0.0119814 0.059661 0.0000041 -0.0000042 -0.0000034 -0.1468068 -0.2624594 0.0275443 0.0000065 -0.0084772 0.0600863 -0.0000093 -0.0000032 -0.0000025 -0.1481314 0.031997 -0.0408743 0.0000165 -0.0501387 0.0075569 -0.0000098 0.0000261 -0.0000073 -0.1628171 0.0362302 0.0336555 0.0000151 0.0498469 0.007196 0.0000048 0.0000221 0.0000018 -0.1625079 0.109847 -0.0352319 -0.0000056 -0.0113996 -0.0202027 0.0000022 -0.0000064 0.0000025 0.1757389 0.1104383 0.0324054 -0.0000066 0.0083755 -0.0173464 0.0000031 -0.0000052 0.0000024 0.1765863 -0.0687662 0.0763758 -0.0000153 0.0873623 0.0443113 0.0000077 -0.0000198 0.0000076 0.1668911 -0.0713621 -0.0789587 -0.000013 -0.0857141 0.0465701 -0.0000039 -0.0000173 -0.0000042 0.1670987 unknown
polarizability: 300.895969|7.0250798|226.1989826|-0.0012966|-0.0020901|65.5076345 unknown
InChI: InChI=1S/C12H4Br2Cl2O2/c13-7-8(14)11-12(10(16)9(7)15)18-6-4-2-1-3-5(6)17-11/h1-4H
charge 0 multiplicity 1
22 atoms
Br -1.523618 -3.332819 0.000039
Br -4.514849 -1.620964 0.000165
Cl -1.501048 3.228244 -0.000036
Cl -4.333465 1.682239 0.000119
O  0.821105 -1.45052 -0.000149
O  0.84277 1.458396 -0.000178
C  -0.370332 -0.698903 -0.000066
C  -0.355906 0.718117 -0.000085
C  2.039647 -0.710373 -0.000041
C  2.05059 0.701721 -0.00006
C  -1.595386 -1.397047 0.000012
C  -1.56728 1.432624 -0.000025
C  -2.820211 -0.67874 0.000064
C  -2.801207 0.737754 0.000045
C  3.240964 -1.433291 0.00006
C  3.262408 1.40685 0.000021
C  4.468208 -0.729868 0.000135
C  4.478905 0.684866 0.000115
H  3.20065 -2.526638 0.000074
H  3.238578 2.500583 0.000006
H  5.409055 -1.288489 0.000211
H  5.428123 1.229157 0.000174
