program: Gaussian 09
title: 000186889
version: EM64L-G09RevD.01
frameworkgroup: C1[X(C24H20O2)]
method: RPBEPBE
basis: SDD
operation: Freq
keyword: #pfreq=noraman
keyword: PBEPBE/SDD
title: #p freq=noraman PBEPBE/SDD
converged: YES YES NO NO
title: Mulliken charges:
elementType: O O C C C C C C C C C C C C C C C C C C C C C C C C H H H H H H H H H H H H H H H H H H H H
charge: -0.272413 -0.265730 0.030468 0.026465 0.324893 0.381840 0.234402 0.216222 0.499799 -0.351095 0.348037 -0.433461 -0.493903 -0.484590 -0.492441 0.170569 -0.494852 -0.371987 -0.410391 -0.444761 -0.265846 -0.258114 -0.254048 -0.235187 -0.674208 -0.686186 0.229010 0.272883 0.269840 0.238920 0.237923 0.229177 0.244189 0.279271 0.226907 0.230378 0.219180 0.218360 0.209963 0.209556 0.210397 0.228070 0.228004 0.232888 0.232439 0.209164
chargesum: 0.00000
title: Mulliken charges with hydrogens summed into heavy atoms:
elementType: O O C C C C C C C C C C C C C C C C C C C C C C C C
charge: -0.272413 -0.265730 0.030468 0.026465 0.324893 0.381840 0.234402 0.216222 0.499799 -0.351095 0.348037 -0.204450 -0.221020 -0.214750 -0.253520 0.170569 -0.256929 -0.142810 -0.166203 -0.165490 -0.038939 -0.027735 0.183491 0.184332 -0.007738 -0.011695
polarizability: 5.11870385e+02 5.04308954e+01 3.32761341e+02 -3.70043426e+00 7.83687401e+00 1.22071287e+02
1716.lowfreq: -12.3388 -4.9703 -0.0007 -0.0005 0.0006 1.7054 29.3454 31.7876 53.3140
frequency: 29.3357 31.7231 53.3114 62.1836 71.7535 96.7947 100.7582 108.7005 137.8549 155.9825 198.8177 211.4415 225.8791 227.3929 245.8639 250.1583 280.0714 287.2690 307.3295 311.1681 331.9582 346.5097 388.5920 420.2292 440.4095 468.8604 477.2608 493.1555 515.9129 526.9676 539.7076 558.7169 573.5633 586.5755 614.8309 637.5173 651.2876 681.1618 701.5770 714.6125 722.7438 738.8123 775.7094 785.3632 798.4333 804.6969 806.3792 828.0014 828.9885 849.0927 855.6059 856.7390 866.8779 881.2186 925.4584 935.0338 942.8571 964.3612 987.1355 988.6807 994.1102 1000.5285 1022.1683 1027.3617 1040.1911 1061.0364 1082.5420 1109.3528 1115.5983 1126.1741 1130.4749 1135.7562 1144.0357 1159.5865 1174.2084 1184.3781 1195.1850 1232.2991 1247.1784 1251.6637 1253.7485 1261.6567 1284.3111 1314.5319 1329.6245 1360.1837 1365.8355 1372.8393 1383.8018 1394.2734 1400.2929 1402.7934 1407.9623 1422.9095 1430.6773 1442.5182 1457.3100 1461.5910 1465.4616 1473.3968 1477.4234 1477.9347 1487.2366 1492.5812 1505.0973 1515.1117 1555.0139 1580.2878 1590.2055 1604.9064 1616.2763 1631.6128 2956.9509 2963.0145 2994.2337 2997.3595 3016.1676 3017.8291 3091.7752 3094.6532 3100.6829 3106.3976 3124.0784 3127.6389 3129.7008 3141.9128 3149.6621 3159.6639 3162.5815 3166.3425 3168.6051 3177.3070
redmass: 3.5167 3.4104 4.2127 2.6510 2.5761 3.7862 3.7318 1.8010 4.5675 4.1759 4.5381 3.9945 1.7196 1.9550 1.4206 3.4438 4.3625 4.7171 4.8447 4.7454 3.8529 6.3379 4.6222 5.7488 3.6462 4.0888 4.0520 5.4453 3.8015 6.3119 5.8526 3.4899 4.7132 5.3533 6.5719 6.6039 4.1979 5.7848 3.2989 5.0222 3.1108 4.2485 1.5049 2.1256 4.6262 1.5554 1.1153 1.9255 1.6612 2.5478 1.6519 4.2539 1.4581 5.3006 4.6140 1.5506 3.0973 1.4162 1.3516 1.4093 1.3423 3.3538 2.7709 3.0037 2.5918 4.6530 2.8248 2.1924 2.1742 2.7561 1.4292 1.4361 1.6906 1.4196 1.1022 1.5607 1.5437 2.1864 1.1935 1.8134 1.7127 1.1428 2.7224 2.5260 2.6431 1.7194 2.0030 1.7019 2.1387 1.3057 1.3115 4.3481 4.1066 4.7449 3.2692 4.1859 1.0419 1.0402 3.5579 3.0462 1.1658 1.0759 1.1846 1.1121 3.1621 3.8430 7.0255 7.9538 6.7927 7.0597 6.2205 7.3108 1.0554 1.0557 1.0361 1.0362 1.1076 1.1077 1.0989 1.0989 1.1012 1.1015 1.0885 1.0851 1.0889 1.0889 1.0886 1.0924 1.0955 1.0937 1.0991 1.0960
irintensity: 0.7163 0.6158 1.0458 0.9982 1.6884 0.4600 2.0962 2.2635 1.2299 0.9603 0.9912 4.1887 0.4090 0.4364 0.4811 1.2149 1.8495 1.5623 3.5490 1.2678 0.8670 0.3658 0.1242 0.6994 2.8539 8.4215 2.4588 1.2252 2.8977 4.2287 5.1630 2.1098 3.5689 1.5084 6.6931 7.5061 4.6968 1.8781 0.2471 8.0551 4.8002 15.5987 111.7511 0.3111 21.3283 18.8495 3.9719 22.0224 3.0007 9.2289 33.9304 25.0148 24.0170 10.7440 54.0939 0.2734 15.9272 0.7576 0.0686 0.2610 0.4939 3.0357 91.0933 18.7644 90.0574 26.7069 160.3239 3.4284 6.5667 28.5246 3.6064 4.8617 81.0371 22.3390 0.2775 16.9319 52.1587 270.7932 12.9356 22.6984 142.1050 0.0035 45.4104 30.7813 43.0681 14.5771 13.4202 4.1771 5.9239 35.1136 26.4018 41.1909 8.5540 3.1120 12.9376 37.4915 10.6990 12.4840 57.8730 6.2688 28.8218 5.4565 24.0803 4.2154 65.2581 26.0980 10.9910 2.9368 1.7020 76.3748 19.8787 4.2452 61.0748 38.0924 31.5044 30.7095 33.2719 20.2236 30.8653 33.0738 29.9694 33.6567 5.6583 3.4701 17.5848 9.9772 1.8852 18.4289 23.1518 33.1322 33.4466 16.7109
temp: 298.150 k
press: 1.00000 atm
elementType: 8 8 6 6 6 6 6 6 6 6 6 6 6 6 6 6 6 6 6 6 6 6 6 6 6 6 1 1 1 1 1 1 1 1 1 1 1 1 1 1 1 1 1 1 1 1
symmnumber: 1
zpe: 967211.7 jmol-1
zpe.correction: 0.368392 hartree
zpe.thermalcorrener: 0.389984 hartree
zpe.thermalcorrenthalpy: 0.390928 hartree
zpe.thermalcorrgfe: 0.317545 hartree
zpe.sumelectzpe: -1075.246918 hartree
zpe.sumelectthermal: -1075.225326 hartree
zpe.sumelectthermalent: -1075.224382 hartree
zpe.sumelectthermalfe: -1075.297764 hartree
dipole: -2.2275 -0.7562 1.6149
dipole: 2.8534
quadrupole: -112.7340 -134.5094 -158.7253
quadrupole: 2.1702 5.6691 -1.5615
quadrupole: 22.5889 0.8135 -23.4024 2.1702 5.6691 -1.5615
hfenergy: -1075.6153098 hartree
pointgroup: C01 [X(C24H20O2)]
dipole: 0.9148722 -0.2428914 -0.6035236 debye
polarizability: 517.4893415|-37.8687573|326.7872976|10.3279111|-10.6014124|122.4263745 unknown
InChI: InChI=1S/C24H20O2/c1-3-25-21-14-10-15-9-11-20-23-17(12-13-19(21)22(15)23)16-7-5-6-8-18(16)24(20)26-4-2/h5-14H,3-4H2,1-2H3
charge 0 multiplicity 1
46 atoms
O  -3.595762 -1.632289 0.350738
O  4.623232 0.941771 0.078218
C  -0.148334 -0.116808 0.216455
C  1.223597 -0.561945 0.244132
C  -0.457205 1.279537 0.092599
C  -1.212096 -1.10523 0.307239
C  2.289538 0.399153 0.145734
C  -1.8477 1.707432 0.078272
C  1.531552 -1.968337 0.371865
C  -2.552875 -0.674981 0.258147
C  -2.899221 0.714718 0.168119
C  0.637963 2.20967 -0.006983
C  -0.871603 -2.507479 0.450387
C  1.961074 1.792055 0.018585
C  0.44439 -2.919005 0.48049
C  3.649395 -0.061396 0.177185
C  2.886564 -2.372482 0.397382
C  -2.236745 3.08285 -0.020524
C  3.940858 -1.436288 0.301358
C  -4.272446 1.129846 0.175724
C  -3.581968 3.464901 -0.02549
C  -4.611303 2.47948 0.078845
C  -4.060318 -2.162881 -0.964038
C  6.04351 0.539089 0.120346
C  -5.157175 -3.183111 -0.673095
C  6.86964 1.817826 0.015133
H  0.43077 3.278768 -0.105461
H  -1.692183 -3.222143 0.561402
H  2.777942 2.514333 -0.057349
H  0.691586 -3.980736 0.598427
H  3.122739 -3.43841 0.495967
H  -1.470957 3.860859 -0.089437
H  4.974347 -1.792257 0.325293
H  -5.042688 0.360888 0.286746
H  -3.848415 4.524866 -0.101362
H  -5.662395 2.787904 0.091698
H  -3.199424 -2.623907 -1.489359
H  -4.436127 -1.320559 -1.579794
H  6.24409 0.00574 1.072132
H  6.254661 -0.149069 -0.723633
H  -5.541147 -3.611728 -1.616868
H  -4.767964 -4.004825 -0.047481
H  -5.997196 -2.710105 -0.135705
H  6.641486 2.498897 0.852467
H  6.656001 2.344289 -0.930632
H  7.947415 1.574802 0.04473
