program: Gaussian 09
title: 000184804
version: EM64L-G09RevD.01
frameworkgroup: C1[X(C12H4Br3ClO2)]
method: RPBEPBE
basis: SDD
operation: Freq
keyword: #p
keyword: freq=noraman
keyword: PBEPBE/SDD
title: #p freq=noraman PBEPBE/SDD
converged: NO NO NO NO
title: Mulliken charges:
elementType: Br Br Br Cl O O C C C C C C C C C C C C H H H H
charge: 0.114399 0.120250 0.112691 0.054104 -0.267239 -0.253685 0.475512 0.454087 0.256574 0.248130 -0.434369 -0.324665 -0.201772 -0.210404 -0.357175 -0.357379 -0.222914 -0.220413 0.267094 0.267276 0.239806 0.240092
chargesum: 0.00000
title: Mulliken charges with hydrogens summed into heavy atoms:
elementType: Br Br Br Cl O O C C C C C C C C C C C C
charge: 0.114399 0.120250 0.112691 0.054104 -0.267239 -0.253685 0.475512 0.454087 0.256574 0.248130 -0.434369 -0.324665 -0.201772 -0.210404 -0.090081 -0.090103 0.016892 0.019679
polarizability: 3.15035389e+02 6.38699455e-01 2.33910286e+02 -8.18767519e-04 2.10882732e-02 6.88491633e+01
1716.lowfreq: -6.1565 0.0015 0.0018 0.0019 3.1026 5.0554 27.1509 44.3009 59.2685
frequency: 27.1466 44.2999 59.2662 78.1745 108.4917 134.6007 140.6987 161.1854 180.5156 202.1438 214.2940 231.6665 251.6516 271.6127 307.4081 318.6656 344.8849 445.9574 486.7620 497.3482 522.9194 532.1197 559.2877 582.7663 590.8651 596.3218 674.8867 681.2521 721.5793 728.5938 760.4055 772.3625 843.4274 854.4232 895.7710 910.6071 936.8084 975.5944 1024.3281 1078.3392 1115.1753 1151.6238 1165.3987 1195.7515 1244.7099 1268.6046 1328.3248 1334.4994 1375.6700 1402.7887 1443.9566 1475.9302 1534.0429 1548.8236 1611.4292 1621.5881 3148.6961 3160.5067 3170.9388 3182.8266
redmass: 10.1494 28.8911 13.4394 6.5720 10.3473 36.6830 68.4654 12.7079 31.9493 8.2669 56.5683 13.9041 14.1040 5.5303 9.9520 12.1509 12.3828 3.1661 10.9848 12.1809 4.5416 8.4363 10.3090 11.5548 12.0568 11.5884 8.5560 4.3679 11.0163 9.4310 1.2267 8.9326 8.1590 1.3458 11.2728 11.5145 1.3663 1.3034 2.0045 3.2406 11.3233 1.9004 1.1129 4.9977 4.7888 1.5385 10.0329 9.8991 10.4418 10.1562 2.4806 2.9455 11.3716 10.0155 8.0212 8.0440 1.0860 1.0904 1.0951 1.1009
irintensity: 0.9424 0.0796 0.3605 0.0058 0.6926 0.4246 0.1193 0.0612 0.0239 0.0055 0.0137 1.2382 0.3125 0.3186 0.1954 0.0546 3.2629 5.4408 1.2385 2.7841 0.0000 1.2635 3.0973 0.2102 2.5029 22.3950 2.2437 0.0129 0.1981 27.2280 110.2621 59.9707 23.8123 0.0001 64.2836 28.7042 5.8509 0.0000 16.7620 17.1034 11.7810 0.3314 11.1104 62.7136 142.1320 5.0503 186.3362 154.6126 329.1294 292.4377 13.2494 282.0653 14.2926 0.7531 17.6116 0.2102 1.8400 11.0035 3.4065 10.7529
temp: 298.150 k
press: 1.00000 atm
elementType: 35 35 35 17 8 8 6 6 6 6 6 6 6 6 6 6 6 6 1 1 1 1
symmnumber: 1
zpe: 324371.7 jmol-1
zpe.correction: 0.123547 hartree
zpe.thermalcorrener: 0.139690 hartree
zpe.thermalcorrenthalpy: 0.140634 hartree
zpe.thermalcorrgfe: 0.076575 hartree
zpe.sumelectzpe: -1109.277757 hartree
zpe.sumelectthermal: -1109.261614 hartree
zpe.sumelectthermalent: -1109.260669 hartree
zpe.sumelectthermalfe: -1109.324729 hartree
dipole: -3.3636 -0.3029 -0.0002
dipole: 3.3772
quadrupole: -111.6896 -134.5970 -140.5503
quadrupole: -1.1043 0.0006 0.0007
quadrupole: 17.2560 -5.6513 -11.6047 -1.1043 0.0006 0.0007
hfenergy: -1109.4013037 hartree
pointgroup: C01 [X(C12H4Br3Cl1O2)]
dipole: 1.3236678 -0.1155374 0.0000896 debye
dipolederiv: 0.0787015 0.0621678 -0.0000081 0.0209056 -0.5383571 0.0000708 -0.0000054 0.0000799 0.0492987 -0.4400566 -0.2741793 0.0000459 -0.307005 -0.0809565 0.0000244 0.0000515 0.0000247 0.0488757 -0.4092777 0.3004094 -0.0000247 0.3210461 -0.1143344 0.0000097 -0.0000208 0.0000049 0.0458631 -0.0088755 -0.0646825 0.0000075 -0.0091392 -0.6572811 0.0000815 0.0000049 0.0000773 0.0089937 -2.132993 0.0073291 -0.0000113 0.089349 -0.2878288 0.0000072 -0.0000201 -0.0000027 -0.1309614 -2.1305891 -0.0817729 0.0000064 -0.0867038 -0.3299122 0.0000419 0.0000241 0.00007 -0.1277571 1.2837302 -0.0701691 -0.0000034 -1.0059529 -0.1495694 0.0000441 0.0001258 0.00004 0.1325931 1.2585063 0.1359821 -0.0000663 0.9881043 -0.0215814 0.0000078 -0.0002226 -0.0000029 0.1145332 1.2526145 0.1538458 0.0000159 0.8934227 0.1079082 0.0000118 -0.0000852 0.0000087 0.0672787 1.2534808 -0.1115298 0.0000636 -0.9008434 0.0874019 -0.0000193 0.00019 -0.0000209 0.0682641 -0.3973615 -0.0794389 0.0000056 -0.1874917 0.9388883 -0.0001256 0.0000232 -0.0001426 -0.140205 -0.2890473 0.1007945 -0.0000071 0.1791703 0.9200251 -0.0001288 -0.0000058 -0.0001179 -0.0648836 0.5570839 0.5242235 -0.0000785 0.6620322 -0.0758708 -0.0000178 -0.0000953 -0.0000123 -0.0543333 0.5101025 -0.5875785 0.0000493 -0.654806 0.0142121 0.0000102 0.0000421 0.0000125 -0.0831821 -0.2643744 -0.0318401 0.0000101 0.0094287 0.0600711 -0.0000247 -0.0000036 -0.0000296 -0.1466537 -0.2676528 0.0273756 0.0000007 -0.0093564 0.0589887 -0.0000357 -0.0000019 -0.0000292 -0.1479821 0.0322406 -0.040485 0.0000177 -0.0490032 0.0065671 -0.0000299 0.0000234 -0.0000279 -0.1630345 0.0345379 0.0347002 0.0000081 0.0482457 0.0087701 -0.000019 0.000014 -0.0000213 -0.1623681 0.1110127 -0.0352274 0.0000003 -0.0106927 -0.0205199 0.0000278 -0.0000018 0.0000274 0.1755898 0.1107283 0.0330103 -0.0000095 0.0091732 -0.0171629 0.0000286 -0.0000074 0.0000271 0.1763671 -0.0708528 0.0762759 -0.0000223 0.0870189 0.0450548 0.0000221 -0.0000271 0.000022 0.1668209 -0.0716585 -0.0792105 0.0000002 -0.0869025 0.045487 0.0000129 -0.0000021 0.0000129 0.1668827 unknown
polarizability: 315.0382794|-0.4164566|233.9073954|-0.000761|-0.0210904|68.8491633 unknown
InChI: InChI=1S/C12H4Br3ClO2/c13-7-8(14)10(16)12-11(9(7)15)17-5-3-1-2-4-6(5)18-12/h1-4H
charge 0 multiplicity 1
22 atoms
Br -1.493153 -3.344131 0.000406
Br -4.484587 -1.681081 0.000293
Br -4.460059 1.73431 -0.000121
Cl -1.495058 3.215046 -0.0004
O  0.835413 -1.448198 0.000077
O  0.838978 1.460257 -0.000361
C  -0.360056 -0.703688 0.000019
C  -0.355452 0.712443 -0.000169
C  2.049561 -0.700806 0.000052
C  2.051423 0.711225 -0.000155
C  -1.58098 -1.408709 0.000154
C  -1.572557 1.418967 -0.000196
C  -2.811241 -0.699249 0.00011
C  -2.806742 0.72035 -0.000066
C  3.254999 -1.416545 0.000228
C  3.258975 1.423612 -0.000184
C  4.477901 -0.705609 0.000194
C  4.479813 0.709006 -0.000012
H  3.2212 -2.510076 0.000384
H  3.228644 2.517157 -0.000342
H  5.422163 -1.25841 0.000327
H  5.425714 1.259026 -0.000038
