program: Gaussian 09
title: 000184803
version: EM64L-G09RevD.01
frameworkgroup: C1[X(C12H5Br2ClO)]
method: RPBEPBE
basis: SDD
operation: Freq
keyword: #p
keyword: freq=noraman
keyword: PBEPBE/SDD
title: #p freq=noraman PBEPBE/SDD
converged: NO NO NO NO
title: Mulliken charges:
elementType: Br Br Cl O C C C C C C C C C C C C H H H H H
charge: 0.095961 0.080142 0.014593 -0.251990 0.378240 0.227788 0.189524 0.163780 -0.259087 -0.376436 -0.332685 -0.349885 -0.230486 -0.180241 -0.238945 -0.211731 0.288198 0.264378 0.260879 0.232374 0.235627
chargesum: 0.00000
title: Mulliken charges with hydrogens summed into heavy atoms:
elementType: Br Br Cl O C C C C C C C C C C C C
charge: 0.095961 0.080142 0.014593 -0.251990 0.378240 0.227788 0.189524 0.163780 -0.259087 -0.112058 -0.044487 -0.089006 -0.230486 -0.180241 -0.006570 0.023897
polarizability: 3.06652598e+02 -2.88276366e+00 1.83411707e+02 -6.49380318e-04 -7.30883322e-03 6.16435828e+01
1716.lowfreq: -7.0799 -4.0860 -0.0019 -0.0015 -0.0013 2.7236 51.0729 54.7162 105.1467
frequency: 51.0693 54.7148 105.1423 127.1493 131.3955 179.1135 182.7785 223.2141 234.3914 247.6561 323.2902 328.0600 352.8763 441.1106 441.3057 514.0314 523.7917 562.5059 568.8959 588.1295 626.4078 674.5280 687.9288 718.8149 755.5626 773.3716 794.6621 824.9274 861.6727 867.7180 904.5860 949.5822 986.9732 992.8312 1017.6815 1096.4344 1120.4695 1159.6489 1168.7915 1185.0212 1237.0004 1291.4022 1340.5821 1345.2342 1400.3598 1418.4454 1438.6876 1472.0807 1552.9244 1592.7694 1597.8301 1635.4832 3141.8213 3159.2653 3177.6813 3185.4592 3192.2198
redmass: 22.0160 7.8459 5.5854 9.3507 38.0791 30.6289 6.5408 17.8066 6.3792 18.3452 9.2712 5.7311 8.8616 3.2195 9.3011 8.2162 4.9504 4.0424 6.5688 8.0127 9.9602 7.7603 8.6788 5.0182 2.0009 2.1984 8.3071 7.1802 1.4153 1.3979 12.5742 1.3831 1.3164 6.6764 2.1710 2.2618 1.8758 1.5779 2.3931 2.3840 2.9805 1.6153 4.4861 7.7203 7.2184 3.4128 2.8455 3.3433 10.4136 7.9065 8.1873 8.6673 1.0866 1.0919 1.0961 1.0979 1.0939
irintensity: 0.0830 0.4841 0.0514 0.7885 0.1412 0.1651 0.7076 1.1908 1.1473 0.4518 0.3571 0.2400 3.7777 8.3249 6.1396 7.4288 1.0970 0.7566 3.9243 14.0609 0.1091 12.1148 11.2839 6.7554 61.7123 38.2846 58.8109 11.1090 23.4311 4.7436 28.5281 3.6074 0.0010 8.6942 29.8338 13.0302 35.7998 22.3268 7.4870 45.3836 18.8336 3.0456 105.2053 78.1352 3.8173 52.9239 40.5613 5.2092 10.5255 40.6184 14.0904 0.8421 3.0390 15.2061 6.7087 10.7598 0.9864
temp: 298.150 k
press: 1.00000 atm
elementType: 35 35 17 8 6 6 6 6 6 6 6 6 6 6 6 6 1 1 1 1 1
symmnumber: 1
zpe: 344090.8 jmol-1
zpe.correction: 0.131057 hartree
zpe.thermalcorrener: 0.144309 hartree
zpe.thermalcorrenthalpy: 0.145253 hartree
zpe.thermalcorrgfe: 0.088926 hartree
zpe.sumelectzpe: -1021.389956 hartree
zpe.sumelectthermal: -1021.376705 hartree
zpe.sumelectthermalent: -1021.375761 hartree
zpe.sumelectthermalfe: -1021.432087 hartree
dipole: -2.9072 -0.5973 0.0001
dipole: 2.9679
quadrupole: -99.0454 -111.8102 -120.9571
quadrupole: -1.1719 -0.0002 -0.0006
quadrupole: 11.5588 -1.2060 -10.3528 -1.1719 -0.0002 -0.0006
hfenergy: -1021.5210137 hartree
pointgroup: C01 [X(C12H5Br2Cl1O1)]
dipole: 1.1480137 -0.213348 -0.0000261 debye
dipolederiv: -0.3423824 0.2719285 0.0000522 0.3522706 -0.1605569 -0.0000539 0.0001848 -0.000096 0.038639 -0.5937254 -0.2569558 0.0000133 -0.3238906 -0.1204391 -0.0000019 -0.0000018 -0.0000102 0.0166176 -0.094437 -0.154741 -0.0000143 -0.046092 -0.6330428 -0.0000724 0.0000273 -0.0000536 -0.0182925 -1.3371274 0.0137856 -0.0000056 -0.0273068 -0.497088 -0.0000686 0.0001276 -0.0000826 -0.1472926 0.1599501 -0.1158426 -0.0000413 0.2613512 -0.3707379 -0.0000017 0.0000239 -0.0000323 0.0450217 0.0627816 0.1241591 -0.0000003 -0.1414869 -0.1256792 -0.0000139 0.0000139 -0.0000244 0.0044448 0.7629668 -0.1723412 -0.0000662 -0.6376763 0.3262667 0.0000497 -0.0001164 0.0000539 0.0856191 0.5814522 0.2208487 0.000094 0.5905349 0.2745734 0.0000411 -0.0000573 0.0000571 0.0700279 0.1512111 0.283651 0.0000863 0.1718287 0.870959 0.0000493 -0.0000143 0.0000687 -0.0282496 0.1149756 -0.077493 -0.000019 0.0982619 0.0538139 0.0000307 -0.0000156 0.0000298 -0.1360748 -0.3826193 -0.0241221 0.0000091 -0.0169182 -0.0940345 0.0000081 0.0000044 -0.0000016 -0.1051531 -0.1093224 -0.1406121 -0.00003 -0.1196231 0.0189873 -0.0000278 0.0000065 0.0000086 -0.166189 0.2489625 -0.7449351 -0.0001353 -0.8133116 0.0266125 0.0000789 -0.0002447 0.0001134 -0.0869549 0.8070405 0.5868599 0.0000272 0.5696819 0.2893461 0.0000109 0.0000462 0.0000046 -0.1094665 -0.1648146 0.1460413 0.0000308 0.2297755 0.0078844 0.0000036 0.0000277 0. -0.1647921 0.0006995 -0.001914 -0.0000046 -0.1283235 0.0833189 0.0000428 -0.0000385 0.0000291 -0.154615 0.088157 0.0075803 -0.0000048 -0.0156136 0.0251984 -0.0000186 -0.0000116 -0.0000028 0.1836446 0.1089692 0.0627145 -0.0000052 0.0226288 -0.013847 -0.0000171 0.0000192 -0.0000245 0.1619428 0.0846935 0.0232496 0.0000054 0.0602783 -0.0281751 -0.0000112 0.0000184 -0.0000226 0.1838725 -0.0275941 -0.0886338 -0.0000061 -0.1150003 -0.0221602 -0.0000229 -0.0000031 -0.0000111 0.164695 -0.119837 0.036772 0.0000145 0.028631 0.0888 -0.0000047 0.0000032 -0.0000036 0.1625552 unknown
polarizability: 306.499687|5.20882|183.5646178|-0.0007874|0.0072953|61.6435828 unknown
InChI: InChI=1S/C12H5Br2ClO/c13-7-5-9-10(12(15)11(7)14)6-3-1-2-4-8(6)16-9/h1-5H
charge 0 multiplicity 1
21 atoms
Br -3.996849 1.823665 0.000185
Br -4.486523 -1.584259 -0.000021
Cl -0.858399 2.890425 0.000224
O  0.861009 -1.921076 -0.000113
C  -0.063117 0.230525 0.000045
C  1.392453 0.371348 0.00003
C  -0.331538 -1.169747 -0.000046
C  1.909345 -0.959037 -0.000064
C  -1.167974 1.108383 0.000113
C  2.306998 1.452856 0.000094
C  -1.61439 -1.721869 -0.000069
C  3.272576 -1.271926 -0.0001
C  -2.491084 0.597846 0.000095
C  -2.695419 -0.813946 0.000004
C  3.68917 1.163628 0.000059
C  4.166834 -0.175965 -0.000038
H  -1.77414 -2.801351 -0.000133
H  1.952663 2.486391 0.000177
H  3.620583 -2.308203 -0.000176
H  4.409435 1.988278 0.000103
H  5.245365 -0.365567 -0.000068
