program: Gaussian 09
title: 000184802
version: EM64L-G09RevD.01
frameworkgroup: C1[X(C12H4Br2Cl2O)]
method: RPBEPBE
basis: SDD
operation: Freq
keyword: #p
keyword: freq=noraman
keyword: PBEPBE/SDD
title: #p freq=noraman PBEPBE/SDD
converged: NO NO NO NO
title: Mulliken charges:
elementType: Br Br Cl Cl O C C C C C C C C C C C C H H H H
charge: 0.113588 0.115392 0.024476 0.043845 -0.241833 0.425062 0.222621 0.365486 0.172320 -0.324508 -0.412447 -0.374114 -0.350217 -0.110252 -0.221953 -0.237445 -0.210061 0.265223 0.264329 0.233691 0.236799
chargesum: 0.00000
title: Mulliken charges with hydrogens summed into heavy atoms:
elementType: Br Br Cl Cl O C C C C C C C C C C C C
charge: 0.113588 0.115392 0.024476 0.043845 -0.241833 0.425062 0.222621 0.365486 0.172320 -0.324508 -0.412447 -0.108891 -0.085889 -0.110252 -0.221953 -0.003754 0.026738
polarizability: 3.04269776e+02 6.55155644e+00 2.17818199e+02 8.18102397e-04 8.99618909e-05 6.42890003e+01
1716.lowfreq: -1.8273 -0.0018 -0.0016 0.0000 3.2348 4.2104 41.5393 65.4030 79.5401
frequency: 41.5379 65.4018 79.5388 106.8125 113.7522 134.3562 166.9483 202.0902 206.8442 224.1857 250.4767 267.3153 311.8043 337.3743 340.4915 371.6854 441.3498 506.4433 546.2418 546.9421 597.6023 604.6327 624.3613 630.6637 687.2372 733.4739 739.8048 759.1494 778.6273 807.7723 845.0514 869.2887 914.3128 951.5624 987.9689 1006.4423 1025.4509 1098.0309 1161.1137 1168.0963 1188.9946 1229.7366 1271.0892 1316.0248 1359.9671 1379.2915 1408.3134 1437.8519 1467.3509 1545.8741 1582.9599 1597.7641 1632.2609 3142.9603 3160.2511 3178.3839 3185.5399
redmass: 19.7586 20.1188 8.4571 5.6265 11.8062 25.3113 23.8813 8.2404 35.5928 20.3040 16.5898 7.5544 19.7772 9.1906 7.5248 10.4281 3.2781 10.0080 10.8678 4.5207 8.8276 7.6098 10.1755 9.4874 8.2637 5.7944 12.2049 1.5949 3.3799 7.9924 8.4393 1.3837 12.5192 1.3802 1.3170 3.3317 3.4595 2.3168 1.5000 2.3595 2.7860 4.6640 2.2205 3.4051 8.2835 8.2848 6.0150 2.6713 3.0572 11.1444 9.5259 7.9200 8.5430 1.0867 1.0918 1.0959 1.0983
irintensity: 0.2311 0.0088 0.9504 0.0450 0.5664 0.5241 0.0024 0.0015 0.1147 0.5596 0.7553 0.0195 0.3624 0.8308 1.4257 0.2941 8.6169 4.4694 18.5181 0.6597 2.4759 5.2190 17.9422 0.0788 4.5536 0.4652 45.9902 77.3194 25.9479 34.8749 2.9941 0.0519 24.7920 3.8947 0.0002 2.9478 53.4509 3.7851 26.7143 27.6579 32.6251 72.6538 39.9432 100.3798 98.1467 10.2148 23.0947 37.4387 3.6060 3.4278 21.6032 1.0051 4.5933 3.0446 14.2563 4.6099 11.3867
temp: 298.150 k
press: 1.00000 atm
elementType: 35 35 17 17 8 6 6 6 6 6 6 6 6 6 6 6 6 1 1 1 1
symmnumber: 1
zpe: 319025.2 jmol-1
zpe.correction: 0.121510 hartree
zpe.thermalcorrener: 0.136110 hartree
zpe.thermalcorrenthalpy: 0.137054 hartree
zpe.thermalcorrgfe: 0.077447 hartree
zpe.sumelectzpe: -1480.770150 hartree
zpe.sumelectthermal: -1480.755550 hartree
zpe.sumelectthermalent: -1480.754606 hartree
zpe.sumelectthermalfe: -1480.814213 hartree
dipole: -3.2006 -0.5955 -0.0001
dipole: 3.2556
quadrupole: -108.2972 -127.0912 -132.3886
quadrupole: 0.1887 0.0002 0.0001
quadrupole: 14.2952 -4.4989 -9.7963 0.1887 0.0002 0.0001
hfenergy: -1480.8916599 hartree
pointgroup: C01 [X(C12H4Br2Cl2O1)]
dipole: 1.2807027 0.0188959 -0.00007 debye
dipolederiv: 0.0340282 -0.0843022 -0.0000212 -0.1604768 -0.534779 -0.0001416 -0.0000354 -0.0001314 0.0552194 -0.6180317 -0.1442874 0.0000275 -0.1840985 0.0468339 0.0000166 0.0000265 0.0000153 0.04848 -0.1034963 -0.1942381 -0.0000482 -0.09381 -0.656228 -0.00018 -0.0000195 -0.0001785 -0.0078297 -0.3697056 0.3116293 0.000111 0.3796778 -0.3519715 -0.0001235 0.0001344 -0.0001248 0.0025233 -1.3064493 -0.0022575 0.000088 0.0552659 -0.4180366 -0.0000857 0.0001088 -0.0000708 -0.1342096 0.2041612 -0.2153912 -0.0000733 0.2551289 -0.2447882 -0.0001064 0.0000575 -0.000072 0.0540272 0.0350868 0.1248345 0.0000308 -0.1641155 -0.1470822 -0.0000264 -0.0000579 -0.000049 0.0041233 0.5871565 -0.1867842 -0.0000819 -0.8137471 -0.0625791 0.0000174 -0.0002459 -0.0000253 0.1272106 0.6853829 0.2166585 0.0000116 0.5288333 0.2370819 0.0000032 0.0000906 0.00002 0.0689337 0.1623774 0.3912502 0.0000913 0.1651534 0.8721725 0.0002659 0.0000355 0.000256 -0.0591999 -0.2319599 0.2843815 0.0000855 0.2086158 0.9876568 0.000268 0.0000624 0.0002349 -0.1265238 0.1131233 -0.0878308 -0.0000363 0.1038332 0.0669875 0.0000476 0.0000201 0.0000587 -0.1341724 -0.1471376 -0.132006 -0.0000315 -0.1156605 0.0316458 0.0000613 -0.0000282 0.0000602 -0.1620845 0.1601726 -0.6566715 -0.0001811 -0.7401608 0.2623622 0.0001257 -0.0002071 0.0001228 -0.013416 0.8623551 0.2088408 -0.0000493 0.4559208 -0.1955841 -0.0000667 0.0000098 -0.0000405 -0.0824227 -0.124264 0.1518849 0.0000449 0.237256 -0.0225313 0.0000247 0.0000681 0.0000321 -0.1621819 -0.0002729 -0.0072665 -0.0000062 -0.109594 0.093887 0.0000749 -0.0000443 0.0000698 -0.1513376 0.1156995 0.0558012 0.0000166 0.010548 -0.0174859 -0.0000496 0. -0.0000536 0.1623723 0.0931711 0.006143 0.0000065 0.0460719 -0.0258003 -0.0000598 0.0000158 -0.0000555 0.1838402 -0.0437111 -0.0900458 -0.0000134 -0.11007 -0.0031148 -0.0000409 -0.0000195 -0.000042 0.1647221 -0.1076861 0.0496572 0.0000287 0.0454281 0.0813534 -0.0000246 0.0000284 -0.0000266 0.1619259 unknown
polarizability: 303.4365322|10.6894248|218.6514306|-0.0161046|0.040899|64.2890126 unknown
InChI: InChI=1S/C12H4Br2Cl2O/c13-8-9(14)12-7(10(15)11(8)16)5-3-1-2-4-6(5)17-12/h1-4H
charge 0 multiplicity 1
21 atoms
Br -2.028723 -3.25632 -0.00071
Br -4.528409 -0.854487 0.000179
Cl -0.471784 3.162452 0.000927
Cl -3.569204 2.298536 0.000883
O  0.797098 -1.793364 -0.000579
C  0.078478 0.433926 0.000059
C  1.540436 0.437639 -0.000048
C  -0.31716 -0.935976 -0.000274
C  1.931217 -0.933298 -0.000446
C  -0.931968 1.415611 0.000433
C  -1.653646 -1.359208 -0.000272
C  2.549397 1.431854 0.000179
C  3.258924 -1.37203 -0.000633
C  -2.291038 1.026135 0.000432
C  -2.655237 -0.354536 0.000097
C  3.898543 1.015769 -0.000004
C  4.249947 -0.362718 -0.000405
H  2.292063 2.493727 0.000486
H  3.509352 -2.436034 -0.000932
H  4.692171 1.769981 0.000168
H  5.306342 -0.651059 -0.00054
