program: Gaussian 09
title: 000184801
version: EM64L-G09RevD.01
frameworkgroup: C1[X(C12H3Br2Cl3O)]
method: RPBEPBE
basis: SDD
operation: Freq
keyword: #p
keyword: freq=noraman
keyword: PBEPBE/SDD
title: #p freq=noraman PBEPBE/SDD
converged: NO YES NO NO
title: Mulliken charges:
elementType: Br Br Cl Cl Cl O C C C C C C C C C C C C H H H
charge: 0.120843 0.059757 0.028297 0.049822 0.058472 -0.229706 0.422519 0.243721 0.384852 0.333916 -0.344216 -0.446558 -0.384613 -0.398695 -0.128468 -0.095776 -0.229415 -0.204708 0.268639 0.239482 0.251835
chargesum: 0.00000
title: Mulliken charges with hydrogens summed into heavy atoms:
elementType: Br Br Cl Cl Cl O C C C C C C C C C C C C
charge: 0.120843 0.059757 0.028297 0.049822 0.058472 -0.229706 0.422519 0.243721 0.384852 0.333916 -0.344216 -0.446558 -0.115975 -0.398695 -0.128468 -0.095776 0.010067 0.047127
polarizability: 2.98476113e+02 5.00767828e+00 2.53041072e+02 4.45310662e-03 2.83341111e-02 6.52438637e+01
1716.lowfreq: -0.0017 -0.0004 0.0007 0.2807 5.1816 5.9726 38.1924 55.0311 69.4045
frequency: 38.1878 55.0310 69.4045 77.3451 84.1227 137.9923 149.8696 168.8870 195.1891 207.2213 211.4853 255.2989 278.7784 283.1396 301.4362 332.6995 347.0725 373.3933 385.5973 516.3466 530.4119 544.7344 573.1531 601.3355 614.5754 637.1514 647.7018 734.0075 738.8348 747.0991 768.5049 798.5401 823.5682 871.8933 907.5251 923.2720 976.6521 1028.6672 1051.7439 1130.2963 1169.6125 1197.7132 1222.1689 1253.0881 1311.1142 1363.0690 1384.2026 1398.1652 1415.2648 1459.8594 1547.4047 1581.9270 1589.0825 1626.1069 3152.5243 3173.4654 3191.7228
redmass: 25.0020 11.6239 46.8001 21.7892 12.3389 25.7325 22.2854 6.7207 32.1338 7.2451 33.9847 30.1403 7.4439 8.8422 12.0037 27.2843 9.0278 10.9020 11.3747 5.3147 11.1244 4.2821 10.3213 10.1181 8.6450 10.4299 10.0745 3.7155 11.8135 10.8398 2.8244 2.4103 7.5792 10.2474 1.3824 12.7426 1.3348 10.9309 2.2720 3.5418 1.5065 5.9733 1.7836 4.8202 7.6880 5.0928 8.0585 3.9786 6.6168 3.0895 10.7085 8.0470 10.4638 9.8814 1.0877 1.0942 1.0969
irintensity: 0.1013 0.3888 0.1590 0.2067 0.7198 0.0890 0.0407 1.0310 0.0909 0.0068 0.0094 0.2714 0.5385 2.3640 2.1232 0.0460 2.6487 0.0613 0.5529 0.6623 13.7647 0.7108 25.4932 1.2463 6.5383 0.2377 13.7751 30.1857 10.6021 62.8525 20.4337 29.6263 32.4604 17.6312 0.5601 27.8203 0.7990 79.4265 32.7760 60.0062 12.2993 44.9888 8.6351 94.4263 105.5591 72.0491 15.8097 51.4319 9.2103 28.6852 4.5584 37.4624 14.4662 3.1586 5.9000 3.2410 4.7618
temp: 298.150 k
press: 1.00000 atm
elementType: 35 35 17 17 17 8 6 6 6 6 6 6 6 6 6 6 6 6 1 1 1
symmnumber: 1
zpe: 294010.1 jmol-1
zpe.correction: 0.111983 hartree
zpe.thermalcorrener: 0.127926 hartree
zpe.thermalcorrenthalpy: 0.128870 hartree
zpe.thermalcorrgfe: 0.065674 hartree
zpe.sumelectzpe: -1940.155316 hartree
zpe.sumelectthermal: -1940.139373 hartree
zpe.sumelectthermalent: -1940.138429 hartree
zpe.sumelectthermalfe: -1940.201625 hartree
dipole: 1.8430 2.3302 0.0004
dipole: 2.9710
quadrupole: -139.1741 -131.5619 -143.8635
quadrupole: 8.9140 0.0015 0.0021
quadrupole: -0.9743 6.6379 -5.6636 8.9140 0.0015 0.0021
hfenergy: -1940.267299 hartree
pointgroup: C01 [X(C12H3Br2Cl3O1)]
dipole: 0.8938477 0.7531927 0.0001675 debye
dipolederiv: 0.0584388 -0.0122288 -0.0000129 -0.1024525 -0.5171003 -0.0000876 -0.0000188 -0.0000642 0.0676363 -0.1628137 0.2013047 0.0000068 0.3244377 -0.4563044 -0.0000381 0.0000309 -0.0000417 0.0172166 -0.0645171 -0.0937238 -0.0000198 0.0200724 -0.6754504 -0.0001042 0. -0.0001062 -0.0044294 -0.5050277 0.3028016 0.0000187 0.3563789 -0.2254051 -0.0000207 0.0000388 -0.0000316 0.0101795 -0.6806593 -0.2359717 -0.0000673 -0.2937593 -0.0999876 -0.0000236 -0.0000667 -0.0000224 0.0094687 -1.3197029 -0.0596303 -0.0000396 -0.1239407 -0.3606309 -0.0000516 -0.0000778 -0.0000355 -0.1255795 0.1278475 -0.1640345 -0.0000126 0.334017 -0.2833076 -0.0000123 0.000063 -0.0000679 0.0446419 0.0973994 0.1855248 0.0000431 -0.2006719 -0.0203343 -0.0000239 -0.0000261 0.0000116 0.012309 0.7950216 -0.0769562 -0.0000145 -0.7112333 -0.1386691 -0.000072 -0.0000821 -0.000029 0.1378349 0.4610092 0.2693509 0.000078 0.8973556 -0.0052328 0.0000415 0.0001568 -0.0000234 0.1179565 0.0858121 0.2480259 0.0000515 0.0111701 0.9635584 0.0001374 0.0000032 0.00017 -0.0529376 -0.2672933 0.0855103 0.0000184 0.1511381 1.003031 0.0001715 0.0000242 0.000141 -0.1500508 0.0454903 -0.0883579 0.000012 0.1142222 -0.0063297 0.0000184 0.0000293 0.0000114 -0.1405657 0.2528655 -0.4687298 -0.0000795 -0.7361089 0.8859721 0.0001192 -0.0000886 0.0001236 -0.1509424 0.4747648 -0.5900623 -0.0000497 -0.7467956 0.045213 0.0000041 -0.0000935 -0.0000079 -0.0322762 0.7526696 0.3268698 0.0000768 0.5544172 -0.0188812 -0.0000042 0.0001047 0.0000135 -0.0095225 -0.0785857 0.0580818 0.0000388 0.1595754 0.0605102 0.0000811 0.0000284 0.0000395 -0.1530585 -0.1269143 0.0924534 -0.0000062 0.0231524 -0.2200974 -0.0000254 0.0000047 -0.0000227 -0.0905541 0.1057157 0.0721714 -0.0000018 0.0309408 0.0059857 -0.0000251 0.0000002 -0.0000194 0.1663021 -0.0079824 -0.0724585 -0.0000485 -0.0819532 -0.0425245 -0.0000704 -0.0000227 -0.0000346 0.1654962 -0.0435382 0.0200592 0.0000082 0.0200376 0.1059851 -0.0000139 -0.0000078 -0.0000041 0.160875 unknown
polarizability: 298.6208539|-4.2987873|252.8963306|0.0100314|0.0268705|65.2438637 unknown
InChI: InChI=1S/C12H3Br2Cl3O/c13-5-3-1-2-4-6-8(15)10(17)9(16)7(14)12(6)18-11(4)5/h1-3H
charge 0 multiplicity 1
21 atoms
Br -1.757026 -3.391213 -0.000494
Br 3.948633 -2.47726 -0.000145
Cl -1.202189 3.188696 0.000482
Cl -4.126416 1.836378 0.000174
Cl -4.435681 -1.359007 -0.000323
O  0.834241 -1.507531 -0.000121
C  -0.2261 0.579362 0.000144
C  1.217553 0.813414 0.000251
C  -0.401773 -0.834652 -0.000082
C  1.812689 -0.484217 0.000076
C  -1.377288 1.392896 0.000208
C  -1.653451 -1.464418 -0.000233
C  2.052361 1.955999 0.000472
C  3.198467 -0.684464 0.000106
C  -2.656666 0.795166 0.000066
C  -2.79392 -0.62527 -0.000156
C  3.449735 1.760154 0.000505
C  4.023692 0.459815 0.000324
H  1.62824 2.962178 0.000617
H  4.117564 2.627228 0.000675
H  5.110834 0.338948 0.000354
