program: Gaussian 09
title: 000184800
version: EM64L-G09RevD.01
frameworkgroup: C1[X(C20H22N4O3)]
method: RPBEPBE
basis: SDD
operation: Freq
keyword: #p
keyword: freq=noraman
keyword: PBEPBE/SDD
title: #p freq=noraman PBEPBE/SDD
converged: YES YES NO NO
title: Mulliken charges:
elementType: O O O N N N N C C C C C C C C C C C C C C C C C C C C H H H H H H H H H H H H H H H H H H H H H H
charge: -0.269156 -0.401794 -0.319583 -0.045339 -0.120495 -0.359016 -0.004444 0.201392 -0.536494 0.433862 -0.375730 0.000943 -0.538974 0.148784 -0.470573 -0.367059 -0.694681 0.368996 0.201449 0.491178 -0.489290 -0.603071 -0.391133 -0.462426 -0.191695 -0.785264 0.113187 0.238118 0.240097 0.235833 0.188940 0.224301 0.225547 0.240469 0.243059 0.212572 0.220357 0.217870 0.277838 0.243389 0.242482 0.381868 0.256475 0.236532 0.229414 0.242857 0.244529 0.264805 0.359072
chargesum: 0.00000
title: Mulliken charges with hydrogens summed into heavy atoms:
elementType: O O O N N N N C C C C C C C C C C C C C C C C C C C C
charge: -0.269156 -0.019926 -0.319583 -0.045339 -0.120495 0.000056 -0.004444 0.201392 -0.058280 0.433862 0.049044 0.000943 -0.089127 0.148784 -0.230104 -0.123999 -0.043883 0.368996 0.201449 0.491178 -0.211451 -0.117199 -0.134658 -0.225894 0.037720 -0.033073 0.113187
polarizability: 3.55968974e+02 2.70750043e+00 2.27210228e+02 -2.05067434e+01 5.20531960e+00 2.03784242e+02
1716.lowfreq: -5.7057 -3.0121 0.0003 0.0006 0.0008 5.6284 9.9061 13.9308 23.9462
frequency: 9.6461 13.8526 23.9235 27.3726 35.5353 46.3702 56.9319 57.8611 97.3092 100.6728 108.7698 116.1410 136.7663 151.9242 185.8274 193.0060 215.2016 234.4225 238.8500 259.2185 276.5940 277.3463 307.2218 321.1092 331.0059 343.9970 377.3666 382.1400 431.5049 439.4911 447.2976 506.6957 528.4822 532.9072 546.9234 556.9794 587.5110 592.2962 613.8132 633.3518 646.0782 671.1464 681.4215 698.1481 721.1097 729.8082 743.5587 755.5936 776.0890 793.5494 806.4905 821.0121 853.7000 866.4000 873.5708 889.9581 905.2090 913.7265 916.6203 924.8682 944.2851 952.4348 957.2601 969.0511 969.9799 975.6373 986.2547 988.2389 1006.6370 1023.8727 1029.0000 1049.4535 1079.3368 1091.4503 1091.7209 1118.3574 1121.9549 1134.4039 1154.6865 1158.9302 1173.1283 1188.3442 1194.8302 1228.1224 1237.7967 1240.0767 1267.1211 1274.9294 1285.2465 1290.4904 1296.2949 1318.0682 1324.3472 1337.6861 1359.3677 1366.9042 1383.1920 1388.3854 1389.7185 1392.4397 1404.9442 1418.3390 1435.1654 1446.1387 1452.0653 1455.2383 1461.3234 1467.5246 1475.0385 1478.0192 1480.2082 1486.0788 1488.4048 1495.6770 1564.1392 1578.9211 1602.1885 1606.5995 1629.9462 2710.2938 2966.9651 2971.5056 2974.2586 2992.2288 3004.6928 3009.7048 3023.7673 3031.6273 3065.3051 3072.8922 3076.1569 3078.5161 3084.6448 3129.3530 3131.8583 3134.4933 3150.2827 3154.4071 3160.6541 3171.6681 3604.1555
redmass: 5.0625 6.8601 6.5023 6.1299 5.6875 3.6933 5.7803 3.9151 1.8693 4.1692 4.3409 4.3511 4.5653 1.1508 4.9001 5.1891 3.2612 3.7737 1.2092 6.0101 3.2156 4.8970 4.9433 3.1325 2.3489 2.9746 3.3250 4.6114 6.4776 4.2586 3.4232 4.6133 3.8051 4.2496 4.6934 5.2365 4.6991 5.7588 4.1586 6.8316 4.5195 4.2982 4.5878 2.3825 1.2447 3.8384 1.3112 3.1871 2.3548 3.6946 2.1054 1.9455 1.7329 1.5342 1.9022 1.5184 2.7557 2.9142 4.1067 3.4789 1.9265 1.4708 9.8375 3.6229 1.0992 1.3364 4.9574 1.7975 9.9088 1.7979 1.7447 2.9837 1.7685 3.9540 2.5178 1.9279 1.7548 2.8806 5.1467 1.9012 1.1197 1.4058 1.3184 1.5478 1.9266 3.1119 1.5797 2.2444 1.3068 1.2785 1.4450 2.4832 1.3908 1.4738 1.9666 1.5264 1.4984 1.2131 4.6588 3.9790 1.7465 4.5377 2.3604 1.2665 5.5189 1.2636 1.0482 1.1314 1.0854 1.0931 1.7810 1.4895 1.6310 1.1117 3.7059 4.6639 6.5912 6.0806 4.4239 1.0727 1.0559 1.0533 1.0456 1.0377 1.0641 1.0601 1.1067 1.0964 1.1015 1.0993 1.0968 1.1023 1.0969 1.0991 1.0869 1.0878 1.0929 1.0912 1.0963 1.0979 1.0846
irintensity: 0.1724 0.4760 1.7251 1.0843 0.0556 0.6547 0.5867 2.4317 1.0902 2.8595 0.5236 0.5401 1.0251 0.3974 0.2371 1.5379 3.6924 1.2440 0.0583 2.4196 0.2927 0.6912 4.4088 1.1017 4.6244 3.1222 7.1714 2.6461 6.7709 4.3663 2.5695 3.5269 4.1403 1.3033 9.0693 4.3870 5.7441 3.2279 5.3209 15.6628 4.7126 1.7097 2.6460 32.0395 117.0079 5.3008 12.2495 23.5196 49.0896 18.2601 13.5713 50.6769 3.9443 10.7452 6.8179 9.0563 18.8689 7.0197 4.6287 11.1495 10.5860 5.8350 5.2377 126.8338 132.7606 0.6783 32.5396 1.1523 0.6491 1.4582 2.5129 0.5299 4.6612 15.2866 9.0802 21.3425 23.7523 11.2273 0.0293 124.6165 10.9543 20.9636 4.7836 4.2703 30.6743 178.8461 7.8903 35.7547 2.2972 16.0429 5.1051 150.0747 7.8950 7.8088 267.4224 6.6414 135.2660 11.4935 50.8911 39.4794 14.6285 90.5415 30.5073 11.1351 44.3635 52.2547 21.1059 11.2840 0.3228 24.5105 54.1298 21.7025 7.6332 7.2315 28.2143 31.7688 34.6012 180.7629 136.1940 402.8027 24.4710 43.2399 23.0749 1.9678 14.5509 20.8173 28.7829 2.9569 8.0972 42.3177 8.9633 63.0082 4.3309 16.3298 6.1326 4.2752 25.7768 1.1134 13.2049 10.0178 88.4585
temp: 298.150 k
press: 1.00000 atm
elementType: 8 8 8 7 7 7 7 6 6 6 6 6 6 6 6 6 6 6 6 6 6 6 6 6 6 6 6 1 1 1 1 1 1 1 1 1 1 1 1 1 1 1 1 1 1 1 1 1 1
symmnumber: 1
zpe: 1018001.3 jmol-1
zpe.correction: 0.387736 hartree
zpe.thermalcorrener: 0.413101 hartree
zpe.thermalcorrenthalpy: 0.414046 hartree
zpe.thermalcorrgfe: 0.327433 hartree
zpe.sumelectzpe: -1218.008110 hartree
zpe.sumelectthermal: -1217.982745 hartree
zpe.sumelectthermalent: -1217.981801 hartree
zpe.sumelectthermalfe: -1218.068414 hartree
dipole: 0.9678 -1.3094 -4.6738
dipole: 4.9493
quadrupole: -177.7828 -152.2293 -151.4814
quadrupole: -3.3653 -7.1918 -5.3677
quadrupole: -17.2850 8.2685 9.0165 -3.3653 -7.1918 -5.3677
hfenergy: -1218.3958467 hartree
pointgroup: C01 [X(C20H22N4O3)]
dipole: -0.4498495 -0.6851708 1.766304 debye
polarizability: 357.3059055|-1.0373158|227.985229|-14.848416|-2.891568|201.6723097 unknown
InChI: InChI=1S/C20H22N4O3/c1-3-5-18-15(8-9-17(13(2)25)20(18)26)12-27-16-7-4-6-14(10-16)11-19-21-23-24-22-19/h4,6-10,23,26H,3,5,11-12H2,1-2H3
charge 0 multiplicity 1
49 atoms
O  0.13441 -1.440619 -0.557494
O  -4.36551 1.4595 -1.306595
O  -6.638285 0.729174 -0.513098
N  3.969612 1.177147 1.96761
N  5.857102 1.38126 0.671671
N  4.392729 2.473849 1.83895
N  5.53241 2.638846 1.064964
C  -2.394712 0.436416 -0.391535
C  -1.56763 1.335209 -1.291626
C  -1.825258 -0.497075 0.508223
C  -1.332327 2.745614 -0.676675
C  -3.818852 0.544777 -0.43527
C  -0.322475 -0.649605 0.611152
C  -4.662407 -0.274036 0.400497
C  -2.650727 -1.30924 1.341246
C  -4.043975 -1.202599 1.287799
C  -0.503689 3.651525 -1.611246
C  1.519071 -1.656107 -0.687629
C  -6.123183 -0.128877 0.307296
C  3.864244 -1.457609 -0.006202
C  2.491194 -1.185282 0.225521
C  4.917927 -0.972425 0.996286
C  1.904545 -2.40064 -1.831486
C  4.251782 -2.19501 -1.146807
C  3.268013 -2.663864 -2.052992
C  -7.052102 -0.972495 1.158416
C  4.907109 0.512387 1.21955
H  -0.597416 0.860367 -1.521477
H  -2.101882 1.468723 -2.249816
H  -2.314701 3.212281 -0.474758
H  -0.819514 2.644034 0.301784
H  0.187863 0.334139 0.604467
H  -0.046936 -1.182962 1.542282
H  -2.179697 -2.029038 2.01921
H  -4.665889 -1.834513 1.929632
H  0.490296 3.211615 -1.818497
H  -1.017765 3.789727 -2.580585
H  -0.347218 4.65167 -1.166908
H  2.209121 -0.604357 1.109048
H  5.924733 -1.246761 0.64055
H  4.759764 -1.475381 1.969128
H  -5.39845 1.390479 -1.206407
H  1.129322 -2.750943 -2.519508
H  5.312088 -2.399087 -1.332242
H  3.570091 -3.234239 -2.938123
H  -6.87055 -0.801145 2.235306
H  -6.900102 -2.050025 0.964446
H  -8.092974 -0.706546 0.921649
H  3.913395 3.257938 2.280695
