program: Gaussian 09
title: 000184799
version: EM64L-G09RevD.01
frameworkgroup: C1[X(C2H3NO6)]
method: RPBEPBE
basis: SDD
operation: Freq
keyword: #pfreq=noraman
keyword: PBEPBE/SDD
title: #p freq=noraman PBEPBE/SDD
converged: YES YES NO NO
title: Mulliken charges:
elementType: O O O O O O N C C H H H
charge: -0.154153 -0.420625 -0.071998 -0.187622 -0.089568 -0.091867 0.239819 -0.360380 0.261159 0.243590 0.267040 0.364604
chargesum: 0.00000
title: Mulliken charges with hydrogens summed into heavy atoms:
elementType: O O O O O O N C C
charge: -0.154153 -0.056020 -0.071998 -0.187622 -0.089568 -0.091867 0.239819 0.150250 0.261159
polarizability: 9.14458197e+01 -2.77414520e+00 4.70089839e+01 5.84747768e+00 3.17477908e-01 4.32770746e+01
1716.lowfreq: -6.5100 0.0006 0.0010 0.0010 3.9753 7.2934 54.1590 63.9045 76.9695
frequency: 54.1504 63.9040 76.9679 95.0901 191.9952 263.9292 279.3343 307.2756 335.6472 444.1453 511.1190 576.9987 597.3440 660.5146 712.3686 816.9613 837.6947 956.8080 1009.3808 1034.3549 1182.6088 1193.4041 1284.8259 1373.8569 1446.5537 1602.2099 1707.6815 2955.4534 3093.5859 3534.1531
redmass: 9.5927 11.4803 4.0862 6.1366 3.3382 7.2478 2.7904 3.7658 3.4579 10.9168 4.1140 9.7784 11.5947 7.8906 14.3336 9.0840 13.0085 3.1982 3.1093 3.6334 1.4101 4.1031 1.2703 1.2555 1.0707 14.5209 11.1928 1.0693 1.0910 1.0659
irintensity: 2.2184 0.0993 5.5984 7.6909 35.5825 4.7548 97.2046 47.0186 70.7095 8.4101 10.9486 5.4708 1.1080 9.3219 117.7224 69.4680 10.3413 162.9587 96.1396 19.0916 126.2055 166.3082 37.8840 31.5193 17.9132 204.9559 156.6877 27.4142 6.1864 18.0135
temp: 298.150 k
press: 1.00000 atm
elementType: 8 8 8 8 8 8 7 6 6 1 1 1
symmnumber: 1
zpe: 174656.7 jmol-1
zpe.correction: 0.066523 hartree
zpe.thermalcorrener: 0.076164 hartree
zpe.thermalcorrenthalpy: 0.077108 hartree
zpe.thermalcorrgfe: 0.030436 hartree
zpe.sumelectzpe: -583.192359 hartree
zpe.sumelectthermal: -583.182718 hartree
zpe.sumelectthermalent: -583.181774 hartree
zpe.sumelectthermalfe: -583.228446 hartree
dipole: -1.1591 1.2886 -0.1816
dipole: 1.7427
quadrupole: -53.5293 -51.1928 -50.8634
quadrupole: -4.4254 -4.6349 -1.4392
quadrupole: -1.6674 0.6690 0.9984 -4.4254 -4.6349 -1.4392
hfenergy: -583.2588825 hartree
pointgroup: C01 [X(C2H3N1O6)]
dipole: -0.4060571 0.3254923 0.4463872 debye
dipolederiv: -0.8093669 -0.1282863 0.114435 -0.2706674 -0.3063441 -0.1321421 -0.1553702 -0.088121 -0.1350479 -0.8211053 -0.0946633 -0.0219008 -0.1674493 -0.2575315 -0.1770311 -0.0822481 -0.1205399 -0.5150184 -0.3892977 0.0039302 0.0246913 0.0030434 -0.1004034 0.0501307 0.4064046 -0.0989092 -0.4397509 -0.5186498 0.0816354 -0.0069916 -0.3540737 -0.8132383 -0.1029417 -0.1191911 -0.1418575 -0.2819942 -0.3020418 0.1590215 -0.150476 0.0727801 -0.1892494 0.2270279 0.2102108 0.1609331 -0.7960723 -0.9619795 0.3104555 0.0815992 0.4573067 -0.2561227 0.0056905 0.1742209 0.031882 -0.3629369 1.5729682 -0.5509623 -0.1427631 -0.5905341 0.518704 -0.1871457 -0.8669625 -0.1119168 1.587947 0.4051631 0.1937268 0.1268346 0.1435654 0.1390634 0.1025742 0.1606427 0.0110949 0.4391646 1.2660296 0.0145591 0.0155164 0.7373882 1.0756304 0.1482847 0.3481288 0.2562609 0.2386258 -0.002587 0.0097912 0.0074078 0.0026667 0.0927684 -0.0016718 -0.0165869 -0.0367378 -0.140713 0.0841131 -0.0646325 -0.0115142 -0.0859725 -0.0012964 0.0139255 -0.0182995 0.058988 0.0899718 0.4767539 0.0654248 -0.0368387 0.0519463 0.0980196 0.053299 -0.0409494 0.0789233 0.3158245 unknown
polarizability: 89.1802419|-11.9197338|45.8888907|-1.3500214|1.5722831|46.6627457 unknown
InChI: InChI=1S/C2H3NO6/c4-1-2(5)8-9-3(6)7/h4H,1H2
charge 0 multiplicity 1
12 atoms
O  -0.021048 0.837381 0.794012
O  -3.376591 0.312809 -0.571776
O  1.206526 0.052432 1.051936
O  -1.018277 -1.169189 -0.001015
O  1.463658 0.34145 -1.375676
O  3.070791 -0.765344 -0.148545
N  2.011574 -0.141968 -0.363998
C  -2.376864 0.876462 0.308463
C  -1.108428 0.020254 0.317548
H  -2.730483 0.950348 1.360216
H  -2.154122 1.893167 -0.051712
H  -3.357538 -0.6781 -0.504751
