program: Gaussian 09
title: 000184798
version: EM64L-G09RevD.01
frameworkgroup: C1[X(C12Br3Cl5O2)]
method: RPBEPBE
basis: SDD
operation: Freq
keyword: #p
keyword: freq=noraman
keyword: PBEPBE/SDD
title: #p freq=noraman PBEPBE/SDD
converged: NO YES NO YES
title: Mulliken charges:
elementType: Br Br Br Cl Cl Cl Cl Cl O O C C C C C C C C C C C C
charge: 0.132371 0.133581 0.127275 0.070514 0.078115 0.073264 0.067880 0.068362 -0.246003 -0.231670 0.491220 0.473564 0.491440 0.476753 -0.443399 -0.333768 -0.393058 -0.381012 -0.203714 -0.211697 -0.119039 -0.120977
chargesum: 0.00000
title: Mulliken charges with hydrogens summed into heavy atoms:
polarizability: 3.87509949e+02 2.54176340e+00 3.03066160e+02 -2.11405903e-04 -6.43138863e-04 7.93584190e+01
1716.lowfreq: -3.1328 0.0011 0.0016 0.0019 3.9277 4.5859 19.5950 26.6642 45.7535
frequency: 19.5933 26.6558 45.7530 57.9024 68.4070 76.0810 80.6294 120.6476 138.7052 153.5916 155.7682 158.3526 173.4763 176.6491 183.7540 199.1218 207.9611 215.7275 226.8767 274.0066 307.7364 319.2816 331.7929 335.5256 344.6983 346.5531 397.6088 413.3689 496.6957 541.2725 572.7646 588.7313 591.3141 595.0521 600.7615 636.8805 658.0565 666.7184 725.8460 764.1612 770.5149 790.5400 862.8033 893.6339 939.8903 943.7615 1108.1232 1125.0579 1202.7662 1252.5570 1321.1412 1329.1352 1344.2925 1362.5983 1387.9189 1400.2013 1534.7600 1538.4513 1571.9314 1594.1964
redmass: 26.1454 37.6783 50.6033 35.6274 35.3679 23.3513 33.7615 45.6251 68.0372 34.0143 13.2666 41.9882 15.6455 14.2432 38.6128 31.3681 34.8601 63.8468 27.9094 30.5658 12.3609 29.0081 12.6712 28.5771 12.2008 12.6037 18.0894 17.8615 15.1485 15.1443 12.0310 13.6559 12.1492 12.0861 12.0950 12.4695 13.7485 13.9892 12.0196 12.0280 13.2008 12.9288 12.7681 13.0127 13.1938 13.2862 12.3992 12.8635 12.1783 12.3340 12.1038 12.0698 12.0285 12.0572 12.3219 12.1506 12.0065 12.0018 12.0223 12.0066
irintensity: 0.0219 0.0033 0.0088 0.0002 0.0693 0.0506 0.0002 0.1927 0.0639 0.0568 0.1747 0.2382 0.0166 0.0628 0.1403 0.0338 0.0054 0.0040 0.0012 0.0471 0.0471 0.0022 0.0091 0.0072 1.3695 3.5932 10.0510 1.6999 0.3073 0.5267 0.0138 36.1069 0.2584 2.1050 2.2949 2.8217 1.3314 1.0566 0.2506 0.0089 75.1312 89.3519 4.4464 21.2715 121.3334 150.0841 15.5408 2.0151 0.1214 5.9189 58.8419 37.5331 3.7717 204.7005 1085.2075 321.6870 28.9098 0.4166 1.8006 0.4821
temp: 298.150 k
press: 1.00000 atm
elementType: 35 35 35 17 17 17 17 17 8 8 6 6 6 6 6 6 6 6 6 6 6 6
symmnumber: 1
zpe: 222916.7 jmol-1
zpe.correction: 0.084904 hartree
zpe.thermalcorrener: 0.106474 hartree
zpe.thermalcorrenthalpy: 0.107419 hartree
zpe.thermalcorrgfe: 0.029833 hartree
zpe.sumelectzpe: -2946.802216 hartree
zpe.sumelectthermal: -2946.780646 hartree
zpe.sumelectthermalent: -2946.779702 hartree
zpe.sumelectthermalfe: -2946.857288 hartree
dipole: 0.5748 -0.3180 -0.0001
dipole: 0.6569
quadrupole: -185.7896 -187.3133 -186.4770
quadrupole: -0.4498 -0.0002 0.0000
quadrupole: 0.7370 -0.7866 0.0496 -0.4498 -0.0002 0.0000
hfenergy: -2946.8871208 hartree
pointgroup: C01 [X(C12Br3Cl5O2)]
dipole: -0.2215032 -0.1331508 0.0000245 debye
dipolederiv: 0.0949122 0.0656824 -0.0000004 0.0127872 -0.4967366 -0.0000064 -0.0000009 -0.0000034 0.064719 -0.4559599 -0.2717662 0.0000159 -0.3173384 -0.0671717 0.0000116 0.0000195 0.000012 0.059136 -0.4230805 0.2951065 0.0000154 0.330971 -0.0988765 -0.0000125 0.0000203 -0.0000134 0.057194 -0.0001553 -0.0642239 0.0000008 0.0011705 -0.6141148 0.0000051 0.0000016 0. 0.0205098 0.0096963 -0.0270924 -0.000001 0.0367037 -0.5769367 -0.0000061 -0.0000001 -0.0000021 0.0274497 0.0077801 0.0248732 -0.0000009 -0.0530479 -0.5853831 0.0000038 -0.0000018 -0.0000016 0.0272819 -0.5712119 0.2723353 -0.0000195 0.3372522 -0.1519771 0.0000122 -0.0000285 0.0000138 0.02019 -0.5752887 -0.2817965 -0.0000239 -0.3377875 -0.1537958 -0.0000145 -0.0000324 -0.0000161 0.0202777 -2.2824326 -0.0302608 -0.0000018 0.0188801 -0.2495576 -0.000014 0.000001 -0.0000377 -0.1148705 -2.2805572 -0.0423426 -0.0000014 -0.0050232 -0.2851984 0.000013 -0.0000027 0.0000391 -0.1110904 1.3606325 -0.0208993 -0.0000404 -0.9684865 -0.143657 0.0000095 -0.0000662 0.0000071 0.1322049 1.3298295 0.0870324 -0.0000402 0.952134 -0.0246807 -0.0000096 -0.0000613 -0.00001 0.1108828 1.3202691 0.1095186 0.0000417 0.9839604 -0.0597058 0.0000129 0.000066 0.0000106 0.1193751 1.3271558 -0.076335 0.0000431 -0.9967397 -0.0876943 -0.000014 0.0000651 -0.0000108 0.116787 -0.4411613 -0.1172229 0.0000019 -0.1488322 0.9063976 0.0000232 0.0000134 0.000011 -0.1386402 -0.3248097 0.1317216 0.0000017 0.1356354 0.8866703 -0.0000187 0.0000103 -0.0000071 -0.0576512 -0.3181664 0.06915 0.0000005 0.0267745 0.8934238 0.0000193 -0.0000123 0.0000109 -0.0836285 -0.3160538 -0.0737379 -0.000001 -0.0115916 0.9150844 -0.0000151 -0.0000097 -0.0000058 -0.0822669 0.6225516 0.5645895 -0.0000236 0.6737704 -0.0787656 -0.0000303 -0.0000326 -0.0000275 -0.0510034 0.5703216 -0.6207115 -0.000024 -0.6678589 0.0145536 0.0000283 -0.0000362 0.0000286 -0.0832201 0.6714064 -0.4951802 0.0000242 -0.6133195 0.0303378 -0.0000294 0.0000415 -0.000028 -0.0263303 0.6743222 0.5015599 0.0000329 0.609986 0.0277841 0.0000317 0.0000462 0.0000304 -0.0273064 unknown
polarizability: 387.5835061|0.4936875|302.9926034|-0.0002344|0.0006351|79.358419 unknown
InChI: InChI=1S/C12Br3Cl5O2/c13-1-2(14)4(16)10-9(3(1)15)21-11-7(19)5(17)6(18)8(20)12(11)22-10
charge 0 multiplicity 1
22 atoms
Br -2.314812 -3.342628 -0.000031
Br -5.316573 -1.676662 0.000115
Br -5.291013 1.732851 0.000116
Cl -2.321663 3.215355 -0.000024
Cl 2.367504 -3.205309 -0.000025
Cl 2.379125 3.209889 -0.00001
Cl 5.197571 -1.618474 0.000127
Cl 5.203804 1.612082 0.000148
O  0.005756 -1.443504 -0.000187
O  0.010834 1.456636 -0.000183
C  -1.196715 -0.69991 -0.000092
C  -1.191291 0.711274 -0.000091
C  1.207603 -0.701134 -0.00009
C  1.210472 0.710685 -0.000086
C  -2.412541 -1.411344 -0.000022
C  -2.404633 1.421951 -0.000023
C  2.42108 -1.412217 -0.000018
C  2.426671 1.417122 -0.000011
C  -3.643225 -0.699058 0.00004
C  -3.63904 0.722323 0.000039
C  3.649312 -0.707541 0.00005
C  3.651971 0.707412 0.000057
