program: Gaussian 09
title: 000186856
version: EM64L-G09RevD.01
frameworkgroup: C1[X(C11H21ClO2)]
method: RPBEPBE
basis: SDD
operation: Freq
keyword: #p
keyword: freq=noraman
keyword: PBEPBE/SDD
title: #p freq=noraman PBEPBE/SDD
converged: YES YES NO NO
title: Mulliken charges:
elementType: Cl O O C C C C C C C C C C C H H H H H H H H H H H H H H H H H H H H H
charge: -0.123421 -0.263323 -0.251435 -0.369240 -0.351557 -0.371487 -0.357189 -0.356213 -0.367028 -0.357024 -0.511808 -0.696268 0.254913 -0.506984 0.219889 0.193365 0.198254 0.222115 0.191847 0.187528 0.314909 0.189321 0.192420 0.215085 0.234336 0.194410 0.195154 0.271217 0.253542 0.210692 0.214944 0.210028 0.240408 0.243055 0.235545
chargesum: 0.00000
title: Mulliken charges with hydrogens summed into heavy atoms:
elementType: Cl O O C C C C C C C C C C C
charge: -0.123421 -0.263323 -0.251435 0.044014 0.068812 0.007887 -0.042279 0.025529 0.082393 0.032540 0.012951 -0.060605 0.254913 0.212024
polarizability: 1.67477933e+02 -9.69388787e-01 1.21310599e+02 3.04016227e+00 -3.07030543e+00 1.15661581e+02
1716.lowfreq: -16.8786 -3.5561 0.0014 0.0016 0.0020 1.6129 21.0141 22.3386 30.1069
frequency: 18.9238 21.8778 29.9789 45.9745 53.4589 70.3511 101.0097 106.2960 116.7861 142.7268 148.1687 164.9259 183.1902 219.9189 223.7536 229.1530 281.6525 311.7667 356.8664 374.3315 432.6220 477.5322 508.6230 542.2519 561.6828 635.9450 720.6499 734.3695 775.3526 798.4760 854.8744 872.3683 888.2314 923.1196 958.1740 983.3620 994.3686 1004.7337 1041.8922 1053.2360 1073.3402 1081.6002 1104.1307 1114.2702 1117.3196 1120.7474 1147.2245 1149.5211 1168.8886 1190.7712 1202.4978 1226.8892 1237.2169 1267.3122 1273.2499 1283.7403 1290.3461 1302.6208 1304.6335 1335.9847 1350.6248 1353.5803 1359.6864 1370.6341 1389.6326 1423.9142 1433.2372 1436.3460 1445.3739 1454.2706 1462.0923 1463.6608 1464.2112 1472.3956 1476.8602 1480.7968 1487.4882 1639.7797 2949.4180 2954.0602 2955.3695 2966.3513 2970.8533 2971.9542 2987.5386 2988.6333 3003.6324 3004.0147 3005.7992 3014.1453 3029.2998 3049.5253 3051.1269 3059.1727 3068.4374 3070.5050 3090.1703 3106.6635 3150.1922
redmass: 2.0511 4.5135 4.1076 3.8757 4.1085 3.6385 1.8868 1.1973 2.1251 2.2451 3.8942 3.4285 4.4165 3.0428 2.4486 1.1644 3.1526 4.2895 2.8296 3.8944 2.9090 3.2752 2.4410 3.6281 3.6954 4.1250 1.0673 1.1290 1.4798 2.0414 2.2959 1.3935 1.9194 3.8271 1.7332 1.5547 3.0711 3.4585 2.3252 2.4315 1.9231 2.1286 2.5900 1.2703 2.4034 2.0103 2.1564 1.5381 1.3155 1.6521 1.2923 1.3140 1.3281 1.2627 1.1801 1.0656 1.1429 1.1734 1.2532 1.4092 1.6541 1.6359 1.5635 1.6021 1.2170 1.1975 1.0847 1.0837 1.0809 1.0499 1.0690 1.0747 1.0505 1.0734 1.0423 1.0791 1.0885 8.5384 1.0590 1.0612 1.0589 1.0596 1.0633 1.0368 1.0953 1.0620 1.0981 1.0447 1.0474 1.0953 1.1038 1.1027 1.0972 1.0990 1.1006 1.0993 1.0893 1.1046 1.1047
irintensity: 0.3113 0.2004 0.7688 1.1459 0.8290 0.2282 0.3991 0.4137 0.4560 0.4120 2.7453 2.3288 6.4283 6.9798 2.6984 0.1271 0.9854 28.0827 3.2478 2.4481 0.8677 1.2032 6.5090 18.1291 0.7544 3.5311 12.7894 0.1347 0.7825 26.5026 28.5670 7.5271 3.8289 1.9371 8.5020 16.6286 0.5677 1.1271 8.8970 2.0804 1.4251 0.5271 24.3085 0.8904 64.5153 94.6506 125.6474 10.2394 67.7510 1.2904 14.5893 7.9810 2.5850 4.5592 1.2364 1.7613 1.7757 14.7293 0.1889 0.8924 43.5902 1.8393 1.8163 3.7760 11.1009 21.1360 2.9460 38.1019 16.2199 14.6499 0.0735 0.4663 12.8514 1.7096 12.3254 3.1462 22.8875 153.3673 2.2284 15.1999 12.1660 39.6280 81.8354 41.9146 2.4555 28.8260 2.4007 42.0169 9.2980 9.1481 26.1199 58.9133 27.1489 4.6746 94.3083 55.6539 15.1312 26.9837 16.6436
temp: 298.150 k
press: 1.00000 atm
elementType: 17 8 8 6 6 6 6 6 6 6 6 6 6 6 1 1 1 1 1 1 1 1 1 1 1 1 1 1 1 1 1 1 1 1 1
symmnumber: 1
zpe: 791728.9 jmol-1
zpe.correction: 0.301554 hartree
zpe.thermalcorrener: 0.319842 hartree
zpe.thermalcorrenthalpy: 0.320786 hartree
zpe.thermalcorrgfe: 0.251153 hartree
zpe.sumelectzpe: -1041.137705 hartree
zpe.sumelectthermal: -1041.119416 hartree
zpe.sumelectthermalent: -1041.118472 hartree
zpe.sumelectthermalfe: -1041.188105 hartree
dipole: -1.2150 -0.8623 1.4844
dipole: 2.1031
quadrupole: -81.2057 -97.5801 -92.8294
quadrupole: 4.3771 1.4770 5.0665
quadrupole: 9.3327 -7.0417 -2.2910 4.3771 1.4770 5.0665
hfenergy: -1041.4392582 hartree
pointgroup: C01 [X(C11H21Cl1O2)]
dipole: 0.4865852 -0.0418151 -0.6679403 debye
polarizability: 167.3797746|-0.8231591|117.6950023|3.8024716|4.0677286|119.3753366 unknown
InChI: InChI=1S/C11H21ClO2/c1-3-4-5-6-7-10(12)8-9-11(13)14-2/h10H,3-9H2,1-2H3
charge 0 multiplicity 1
35 atoms
Cl 0.59531 1.32764 1.983522
O  4.91969 -0.466565 0.282523
O  2.97292 -1.269907 -0.707489
C  -1.9305 0.095506 0.247861
C  -0.785162 0.87053 -0.437191
C  -3.291735 0.309566 -0.451699
C  0.602983 0.647694 0.170785
C  -4.450522 -0.450972 0.23127
C  1.732313 1.356398 -0.590118
C  -5.814867 -0.238344 -0.46378
C  3.14696 1.114624 -0.033263
C  -6.967846 -0.998621 0.226745
C  3.61971 -0.320264 -0.204797
C  5.494963 -1.831094 0.188678
H  -2.001948 0.413437 1.305715
H  -1.686732 -0.987096 0.257832
H  -0.719643 0.552079 -1.500628
H  -1.010708 1.955472 -0.44454
H  -3.527648 1.394389 -0.469137
H  -3.219284 -0.010649 -1.512598
H  0.821236 -0.422085 0.313646
H  -4.21668 -1.536037 0.252309
H  -4.525966 -0.129333 1.290918
H  1.685562 0.999992 -1.638974
H  1.528492 2.443407 -0.602252
H  -5.738766 -0.561422 -1.522293
H  -6.046682 0.846221 -0.485918
H  3.184558 1.368366 1.042982
H  3.881369 1.775959 -0.529906
H  -7.083241 -0.672716 1.277791
H  -7.931799 -0.8290 -0.28755
H  -6.775507 -2.088266 0.233932
H  5.55537 -2.14892 -0.865832
H  4.870196 -2.547962 0.747356
H  6.495204 -1.744026 0.6350
