program: Gaussian 09
title: 000186852
version: EM64L-G09RevD.01
frameworkgroup: C1[X(C17H18N2O3)]
method: RPBEPBE
basis: SDD
operation: Freq
keyword: #p
keyword: freq=noraman
keyword: PBEPBE/SDD
title: #p freq=noraman PBEPBE/SDD
converged: YES YES NO NO
title: Mulliken charges:
elementType: O O O N N C C C C C C C C C C C C C C C C C H H H H H H H H H H H H H H H H H H
charge: -0.303005 -0.448888 -0.258283 -0.443526 -0.499066 0.129745 0.479084 -0.696152 -0.781176 -0.380902 -0.422091 0.317749 -0.263040 -0.241161 -0.237706 0.485023 -0.330338 -0.445757 0.265000 -0.358152 -0.309113 0.102314 0.211738 0.277106 0.221877 0.240687 0.210142 0.233328 0.282919 0.293421 0.241010 0.228863 0.223529 0.292742 0.229322 0.310546 0.219383 0.269106 0.272727 0.380996
chargesum: 0.00000
title: Mulliken charges with hydrogens summed into heavy atoms:
elementType: O O O N N C C C C C C C C C C C C C C C C C
charge: -0.303005 -0.067892 -0.258283 -0.160607 -0.206324 0.129745 0.479084 0.014568 -0.097019 -0.087481 -0.181081 0.317749 -0.034177 -0.017633 -0.008384 0.485023 -0.019792 -0.226374 0.265000 -0.089046 -0.036386 0.102314
polarizability: 3.34085823e+02 1.79213612e+01 1.86320951e+02 1.23964996e+01 2.38610844e+01 1.48811763e+02
1716.lowfreq: -4.5120 -0.0008 -0.0005 0.0004 1.4218 3.6158 18.1591 21.6058 33.8452
frequency: 18.0547 21.3876 33.7867 52.5518 71.7613 82.0313 103.3191 121.6167 140.2278 167.4526 185.7064 205.2520 231.6772 244.3067 285.9299 300.3179 315.1665 320.6217 326.0235 359.8521 371.0503 403.4307 411.4944 412.8902 438.9775 477.7568 497.0272 505.8516 542.0809 564.6702 584.1327 593.2591 597.6756 617.2582 627.7887 686.2221 691.5661 699.9103 711.6516 733.4606 759.4547 764.3984 773.0946 817.8640 835.1018 860.8654 880.9341 882.5183 927.0469 939.5199 943.6735 973.3259 984.7745 990.1790 993.4256 1005.1932 1008.4177 1008.6959 1016.3588 1026.6674 1032.8865 1083.9399 1107.7968 1125.5342 1151.5619 1161.6666 1174.3866 1186.1168 1196.4287 1203.7899 1230.7297 1250.4776 1276.9096 1303.9620 1321.6221 1329.0765 1366.5429 1377.1167 1382.3989 1399.3873 1427.8749 1434.3762 1453.5995 1468.5768 1474.2119 1483.2892 1487.1284 1488.2949 1493.2844 1513.4456 1581.5304 1589.2837 1612.1522 1623.0553 1642.5487 1647.1602 2979.5811 2995.8200 3074.9663 3086.1861 3101.5073 3112.3654 3121.7665 3130.3379 3135.3007 3143.0912 3152.6886 3156.0683 3164.2167 3177.4729 3202.1721 3510.3470 3525.7582 3534.5398
redmass: 5.8487 4.8222 4.4095 5.7339 6.6654 6.2119 6.2240 4.5947 3.8822 4.3176 4.3872 2.3206 1.9359 2.3201 4.1732 3.2639 3.5434 1.2310 2.6438 3.4576 4.8629 2.8568 3.6040 3.1658 1.5463 4.1730 4.4605 2.4720 3.7105 3.4396 1.2122 1.5012 2.6981 6.3871 7.0028 3.7228 6.0988 5.3834 1.9221 4.4341 4.5460 5.4013 2.0245 4.2335 1.4225 1.2505 3.5408 1.5053 1.6261 1.4087 2.2659 1.3689 1.4028 5.1474 4.9143 1.3669 1.3942 1.5217 2.4303 2.7070 2.6204 1.7246 1.9993 1.3231 1.6302 2.3587 1.0883 2.3086 1.1959 1.1396 2.7579 3.1665 2.2041 1.5123 2.7337 1.3610 4.4448 4.3609 1.3406 1.2077 4.7476 2.1766 1.1315 1.0832 1.4069 1.6073 1.3980 1.5180 1.2160 3.0181 5.7462 5.8261 5.8304 5.7216 8.3759 4.5769 1.0384 1.0379 1.0967 1.1001 1.0996 1.0902 1.0847 1.0891 1.0971 1.0933 1.0951 1.0912 1.1005 1.0944 1.0946 1.0766 1.0757 1.0641
irintensity: 0.0052 1.5144 0.1810 0.0110 2.2667 0.8462 10.7775 2.2079 0.9745 0.3798 0.0682 1.5055 0.7917 10.1818 0.8116 4.4675 1.5639 1.1740 0.9386 0.2703 16.3566 0.4749 11.7587 2.7483 29.1323 15.2032 5.6208 81.7589 3.2786 24.3579 31.7920 112.3038 74.5340 1.6125 1.4787 83.9193 0.8357 26.5776 58.6858 0.9720 18.2022 18.1963 27.0974 0.5477 29.7266 1.3181 0.3933 52.4940 4.5355 2.9072 0.4126 0.2345 1.9906 0.0400 224.1896 13.6801 8.4710 12.5821 182.1040 11.3282 11.2913 7.5453 8.1903 10.4512 315.7630 59.0282 0.3614 74.2720 10.2043 24.6635 437.7649 136.3836 9.7717 4.3181 191.7775 2.5632 357.7990 7.4090 34.0645 46.8336 26.5007 8.5814 51.7220 42.5524 191.7735 131.1578 182.6366 26.9798 144.2736 296.6981 72.5559 2.5573 6.5221 210.4840 353.5778 121.3161 21.4318 27.1607 32.4980 25.7288 50.6761 19.6635 0.3696 17.3761 4.5368 2.6528 35.5995 1.5461 31.4779 2.0524 5.0879 16.2956 18.5152 51.6376
temp: 298.150 k
press: 1.00000 atm
elementType: 8 8 8 7 7 6 6 6 6 6 6 6 6 6 6 6 6 6 6 6 6 6 1 1 1 1 1 1 1 1 1 1 1 1 1 1 1 1 1 1
symmnumber: 1
zpe: 834592.9 jmol-1
zpe.correction: 0.317880 hartree
zpe.thermalcorrener: 0.338377 hartree
zpe.thermalcorrenthalpy: 0.339321 hartree
zpe.thermalcorrgfe: 0.266774 hartree
zpe.sumelectzpe: -992.237971 hartree
zpe.sumelectthermal: -992.217474 hartree
zpe.sumelectthermalent: -992.216530 hartree
zpe.sumelectthermalfe: -992.289077 hartree
dipole: -3.8892 -4.0212 -3.9770
dipole: 6.8638
quadrupole: -127.8473 -121.4538 -130.4170
quadrupole: -3.5514 -4.9299 3.5745
quadrupole: -1.2746 5.1189 -3.8443 -3.5514 -4.9299 3.5745
hfenergy: -992.5558509 hartree
pointgroup: C01 [X(C17H18N2O3)]
dipole: -1.3898874 -1.3669953 -1.8686569 debye
polarizability: 330.8286406|14.7223275|179.520125|27.4727198|29.1934121|158.8697712 unknown
InChI: InChI=1S/C17H18N2O3/c1-17(2,13-6-4-3-5-7-13)19-16(22)18-14-10-8-12(9-11-14)15(20)21/h3-11,18-20H,1-2H3
charge 0 multiplicity 1
40 atoms
O  -0.60107 -0.242437 1.39259
O  6.932947 0.170511 -0.310149
O  6.352507 1.378062 1.587689
N  -1.679708 -1.323178 -0.410892
N  0.640013 -1.115682 -0.416765
C  -3.112802 -1.341525 0.047855
C  -3.787728 0.027421 -0.243008
C  -3.202744 -1.674863 1.561346
C  -3.766074 -2.503943 -0.743067
C  -3.265354 1.203375 0.363641
C  -4.921918 0.15262 -1.084316
C  -0.567955 -0.842148 0.27678
C  -3.85936 2.461161 0.130023
C  -5.519573 1.414009 -1.317279
C  -4.991135 2.574438 -0.711897
C  1.942593 -0.659419 -0.111898
C  2.245953 0.16974 1.006465
C  2.993362 -1.063945 -0.987678
C  4.61983 0.179843 0.350052
C  3.572159 0.579412 1.221086
C  4.31424 -0.651488 -0.760024
C  5.995278 0.643412 0.63221
H  -2.713547 -2.643408 1.770962
H  -2.719814 -0.904748 2.178568
H  -4.267561 -1.746275 1.844583
H  -3.23982 -3.445913 -0.510902
H  -3.726223 -2.339627 -1.837306
H  -4.823916 -2.625009 -0.455774
H  -1.562965 -1.538555 -1.404453
H  -2.387747 1.126636 1.01502
H  -5.356967 -0.728819 -1.565755
H  -3.43919 3.354062 0.606712
H  -6.397113 1.486029 -1.970184
H  0.579589 -1.742876 -1.222031
H  -5.453212 3.551822 -0.89094
H  1.444652 0.464833 1.684688
H  2.766302 -1.702842 -1.851178
H  3.819867 1.217465 2.075966
H  5.117821 -0.962856 -1.432751
H  7.828587 0.521404 -0.058191
