program: Gaussian 09
title: 000186849
version: EM64L-G09RevD.01
frameworkgroup: C1[X(C21H13Br)]
method: RPBEPBE
basis: SDD
operation: Freq
keyword: #p
keyword: freq=noraman
keyword: PBEPBE/SDD
title: #p freq=noraman PBEPBE/SDD
converged: NO YES NO NO
title: Mulliken charges:
elementType: Br C C C C C C C C C C C C C C C C C C C C C H H H H H H H H H H H H H
charge: -0.062602 -0.008984 -0.021539 0.267564 0.389478 0.188334 0.056803 0.339729 0.492494 0.497852 -0.439357 -0.459173 -0.513739 -0.519596 -0.370448 -0.940953 -0.465075 -0.463600 -0.404262 -0.245824 -0.269288 -0.275919 0.248160 0.228475 0.240216 0.240386 0.229297 0.299995 0.298971 0.245777 0.245811 0.253731 0.230990 0.232347 0.233945
chargesum: 0.00000
title: Mulliken charges with hydrogens summed into heavy atoms:
elementType: Br C C C C C C C C C C C C C C C C C C C C C
charge: -0.062602 -0.008984 -0.021539 0.267564 0.389478 0.188334 0.056803 0.339729 0.492494 0.497852 -0.210881 -0.211012 -0.273523 -0.279210 -0.141151 -0.341987 -0.219298 -0.217789 -0.150530 -0.014834 -0.036941 -0.041974
polarizability: 4.53886151e+02 4.17866721e+01 3.12614889e+02 9.19567439e+00 -8.08299319e+00 1.08691072e+02
1716.lowfreq: -12.8192 -8.7900 -7.0246 0.0005 0.0005 0.0006 35.2864 38.4708 60.9853
frequency: 35.2388 38.3905 60.9832 80.9569 124.8386 169.9335 186.1269 216.3885 232.0046 290.2256 327.8973 328.5576 358.9016 381.1523 393.6815 456.1460 460.8304 473.2565 495.8748 501.6267 513.2079 523.9793 528.3717 562.6098 565.8581 581.6165 628.7167 641.5328 690.9488 701.1379 713.2613 725.0640 769.3750 772.7115 785.8243 790.9243 809.0503 837.3806 860.6146 868.3378 871.3963 899.2284 917.7685 953.4785 954.8865 961.6918 980.4036 983.7455 991.7354 993.1395 1023.6734 1047.1760 1076.9190 1082.4977 1120.3706 1128.8549 1144.9182 1170.3614 1184.0357 1189.2471 1196.0669 1205.6322 1234.4169 1260.4222 1268.7493 1289.4481 1321.7112 1356.9945 1376.9605 1396.6759 1402.6227 1417.7926 1427.6771 1428.8814 1441.4195 1468.9929 1474.0818 1495.1302 1500.8798 1521.2690 1556.4456 1586.1013 1589.7345 1604.5658 1618.8845 1634.1145 3095.9862 3125.9280 3129.5562 3130.2638 3133.0581 3134.7600 3146.9719 3159.2835 3160.1866 3163.1125 3168.1334 3172.3375 3174.8423
redmass: 9.3027 6.9580 5.6085 5.1394 5.3850 4.9793 4.1221 4.4998 4.8689 4.3517 5.2105 6.0756 3.3001 4.8256 4.1762 4.4688 3.3869 5.5995 4.2282 6.5515 3.6850 6.6065 3.5485 4.3554 3.3245 5.1274 6.0409 4.0507 6.1533 2.9909 4.2987 3.0198 1.2593 1.5309 3.2173 2.3610 3.8677 1.5954 1.8675 4.5895 2.2162 2.4980 1.4527 2.7728 1.8817 1.7433 1.6209 1.4701 1.4220 1.4964 5.7667 2.2748 2.6768 2.5816 1.3254 2.2343 1.8891 1.3363 1.2991 1.1541 1.1716 1.2634 1.7924 1.8648 1.5880 2.5659 2.3152 3.8664 3.5413 4.2953 2.6716 3.2554 3.4243 2.8488 4.7265 2.4450 2.6422 3.6986 1.7402 3.1095 6.3796 8.2832 5.4575 6.5198 5.9491 7.0947 1.0585 1.0865 1.0884 1.0879 1.0859 1.0914 1.0894 1.0962 1.0990 1.0978 1.0966 1.1036 1.0973
irintensity: 0.4452 0.3132 0.6892 0.9268 2.5991 3.2945 1.1205 5.1654 3.4709 1.3866 7.6548 3.3559 0.6682 1.7380 35.2807 0.5854 19.9576 37.6580 33.0299 2.0738 7.8086 4.3901 8.5731 16.9513 2.1105 2.4025 2.6469 5.4699 9.7803 1.4154 12.5394 27.0960 4.4015 108.9702 6.1611 1.5968 13.6241 4.0450 1.9633 4.3152 82.8738 9.8525 0.2219 6.4508 9.0876 2.2035 3.7861 1.3585 0.2919 1.1919 3.2218 9.0741 24.6080 7.5686 1.9611 1.7672 8.5071 6.9007 0.1131 2.8107 108.2541 28.6814 0.9011 14.0187 3.0110 20.0703 1.1342 29.1466 6.2919 0.8867 2.3643 0.1607 0.0669 1.3886 1.4526 18.6213 12.6686 2.6089 5.2976 2.5445 4.5343 3.7148 27.6564 3.2988 5.8332 2.6533 16.6177 0.3833 3.2806 2.5586 2.0900 21.6505 9.7660 4.6897 39.3433 20.2880 34.3232 2.0594 40.6897
temp: 298.150 k
press: 1.00000 atm
elementType: 35 6 6 6 6 6 6 6 6 6 6 6 6 6 6 6 6 6 6 6 6 6 1 1 1 1 1 1 1 1 1 1 1 1 1
symmnumber: 1
zpe: 706569.2 jmol-1
zpe.correction: 0.269118 hartree
zpe.thermalcorrener: 0.284969 hartree
zpe.thermalcorrenthalpy: 0.285913 hartree
zpe.thermalcorrgfe: 0.224578 hartree
zpe.sumelectzpe: -820.105696 hartree
zpe.sumelectthermal: -820.089845 hartree
zpe.sumelectthermalent: -820.088900 hartree
zpe.sumelectthermalfe: -820.150235 hartree
dipole: -2.7671 1.7173 1.3232
dipole: 3.5152
quadrupole: -122.7047 -119.3179 -142.1768
quadrupole: 8.2518 6.9388 -5.7819
quadrupole: 5.3617 8.7485 -14.1103 8.2518 6.9388 -5.7819
hfenergy: -820.3748139 hartree
pointgroup: C01 [X(C21H13Br1)]
dipole: 0.7176204 0.9897205 -0.6466508 debye
polarizability: 462.2226604|21.7729894|304.3377969|-8.789055|-9.2671062|108.6316547 unknown
InChI: InChI=1S/C21H13Br/c22-12-19-16-7-2-1-6-15(16)17-10-8-13-4-3-5-14-9-11-18(19)21(17)20(13)14/h1-11H,12H2
charge 0 multiplicity 1
35 atoms
Br -2.756187 -3.732941 1.116816
C  0.507257 0.022775 -0.072472
C  1.946452 0.107526 -0.017958
C  -0.28337 1.219154 -0.011711
C  -0.134563 -1.277116 -0.202917
C  -1.733265 1.124133 -0.029942
C  -1.551477 -1.365614 -0.304262
C  -2.362717 -0.174534 -0.164708
C  2.754634 -1.085647 -0.059184
C  2.59887 1.389237 0.080597
C  0.398232 2.486053 0.081944
C  0.713096 -2.456214 -0.216128
C  2.088263 -2.366132 -0.145043
C  1.780878 2.57161 0.124148
C  -2.570253 2.281544 0.084576
C  -2.200412 -2.671537 -0.601612
C  4.1677 -0.980854 -0.003374
C  4.021882 1.455416 0.130367
C  -3.797581 -0.244841 -0.139709
C  4.796699 0.282173 0.088711
C  -3.963085 2.182228 0.086165
C  -4.582956 0.902085 -0.017322
H  0.252452 -3.447405 -0.242917
H  -0.182534 3.411007 0.119855
H  2.700101 -3.275717 -0.143508
H  2.270381 3.54986 0.194474
H  -2.118834 3.272314 0.183771
H  -3.15443 -2.584562 -1.134844
H  -1.55103 -3.389457 -1.114926
H  4.771694 -1.895144 -0.031609
H  4.506908 2.43566 0.203188
H  -4.294147 -1.218258 -0.177503
H  5.889154 0.345739 0.129205
H  -4.577976 3.083688 0.179363
H  -5.67454 0.817972 0.010671
