program: Gaussian 09
title: 000186817
version: EM64L-G09RevD.01
frameworkgroup: C1[X(C12H4Cl4O2)]
method: RPBEPBE
basis: SDD
operation: Freq
keyword: #p
keyword: freq=noraman
keyword: PBEPBE/SDD
title: #p freq=noraman PBEPBE/SDD
converged: YES YES NO NO
title: Mulliken charges:
elementType: Cl Cl Cl Cl O O C C C C C C C C C C C C H H H H
charge: 0.055036 -0.003328 0.033097 -0.025935 -0.111075 -0.099779 0.519386 0.468702 -0.581513 -0.261620 -0.366966 -0.311753 0.186447 -0.259187 0.151801 -0.111947 -0.196176 -0.209202 0.291904 0.292827 0.268532 0.270750
chargesum: 0.00000
title: Mulliken charges with hydrogens summed into heavy atoms:
elementType: Cl Cl Cl Cl O O C C C C C C C C C C C C
charge: 0.055036 -0.003328 0.033097 -0.025935 -0.111075 -0.099779 0.519386 0.468702 -0.581513 0.030284 -0.366966 -0.018926 0.186447 -0.259187 0.151801 -0.111947 0.072356 0.061547
polarizability: 2.72612964e+02 4.26087326e+00 1.91106537e+02 1.86254227e+00 1.32957608e+00 1.09500393e+02
1716.lowfreq: -5.2615 -2.4214 -0.0009 -0.0003 0.0015 4.4039 28.1145 43.0982 60.1177
frequency: 28.1015 43.0971 60.1171 63.2220 72.7856 91.2967 140.3245 191.2010 197.3211 215.8519 252.1968 282.9806 289.2604 294.7499 300.7196 313.2838 321.3702 355.9374 395.4769 429.0191 453.9042 503.2658 514.8230 566.4412 591.8019 615.3273 649.3687 668.3958 697.1399 727.2776 799.1979 815.8473 833.5918 841.8661 888.8483 895.6164 925.5829 952.1541 1019.2098 1077.3947 1088.4878 1110.7185 1134.9638 1175.4159 1240.6044 1274.0703 1331.4322 1359.1960 1387.3075 1443.8578 1530.6646 1555.3191 1569.5301 1591.1539 1594.4618 1607.2236 3167.7721 3169.6163 3175.6533 3185.8014
redmass: 23.4590 14.3314 15.5739 8.7402 20.4575 11.4232 27.0436 10.7494 12.1183 9.9815 11.9289 12.6472 11.8747 8.0441 7.6839 18.9057 7.1887 16.1212 5.7941 5.6299 4.6470 8.1098 6.2835 9.0189 6.9275 8.9357 6.2990 7.0484 8.5224 4.4977 9.5578 1.3462 11.2598 10.3810 1.3915 1.5189 7.5989 1.3503 7.7555 5.4317 2.0859 4.4863 1.4577 4.8738 1.8101 1.6606 1.9321 8.3170 4.3428 2.7036 11.2125 6.9048 12.0739 10.0747 9.6798 8.0588 1.0893 1.0924 1.0932 1.0981
irintensity: 0.0921 1.4235 0.0441 0.4420 0.0635 0.9226 0.2543 2.9293 2.5438 0.7013 0.3417 0.9277 0.7661 2.9044 0.8188 0.3848 0.9675 2.8249 1.1860 1.3745 4.0039 22.2216 46.5414 25.1780 29.4461 2.7236 6.2228 14.1880 26.6663 1.0452 33.9058 41.8648 0.7640 0.5137 15.1734 5.2478 49.2542 0.0309 64.2008 24.3302 52.9123 66.9002 7.3505 64.8391 10.7831 24.8062 56.0262 2.0760 46.2238 72.2625 98.1729 29.2201 169.7469 33.0356 9.2454 57.9370 0.0649 0.8300 0.3779 0.4183
temp: 298.150 k
press: 1.00000 atm
elementType: 17 17 17 17 8 8 6 6 6 6 6 6 6 6 6 6 6 6 1 1 1 1
symmnumber: 1
zpe: 323402.2 jmol-1
zpe.correction: 0.123177 hartree
zpe.thermalcorrener: 0.139586 hartree
zpe.thermalcorrenthalpy: 0.140530 hartree
zpe.thermalcorrgfe: 0.076641 hartree
zpe.sumelectzpe: -2449.069153 hartree
zpe.sumelectthermal: -2449.052744 hartree
zpe.sumelectthermalent: -2449.051800 hartree
zpe.sumelectthermalfe: -2449.115690 hartree
dipole: 5.5142 -3.9657 -0.5582
dipole: 6.8150
quadrupole: -144.8803 -134.3411 -130.3462
quadrupole: 2.1189 2.7718 -3.9085
quadrupole: -8.3578 2.1814 6.1764 2.1189 2.7718 -3.9085
hfenergy: -2449.1923301 hartree
pointgroup: C01 [X(C12H4Cl4O2)]
dipole: -2.4119735 1.0297893 0.5576363 debye
dipolederiv: -0.226909 -0.3541325 -0.0738652 -0.2698958 -0.6098821 -0.147244 -0.0782661 -0.1409646 -0.0270214 -0.3114969 -0.0434817 -0.2434326 -0.0403816 -0.0518344 -0.0916804 -0.1340233 -0.0922605 -0.5784522 -0.2805209 -0.29015 -0.064335 -0.463148 -0.6799231 -0.1612185 -0.1151281 -0.1888721 -0.0487747 -0.4074978 -0.0376485 -0.2965046 -0.0866952 -0.0581048 -0.0929964 -0.4405915 -0.0739175 -0.5326861 -0.5612494 0.3036511 0.115593 0.3091888 -0.6781944 -0.1520086 0.0895141 -0.1473889 -0.3064654 -0.9101666 -0.1249721 0.0335452 -0.0086185 -0.2536235 0.0043246 0.0765684 0.0139622 -0.2576608 0.7461559 -0.0846751 -0.0968046 0.0792298 0.0273273 -0.0294293 -0.1400111 0.0303597 0.0481874 -0.2207788 -0.0102248 -0.0872475 -0.0300545 -0.0264331 0.0099677 0.0384346 -0.0417504 -0.0974929 -0.3948988 0.9494722 0.2862943 0.3321164 0.6861229 0.1754524 0.223255 0.0894163 -0.1004664 -0.2067811 -0.1476634 -0.0650667 -0.0876456 0.0606733 0.0197527 -0.2151103 0.0652415 0.05404 0.4031804 0.0558442 0.4702217 -0.1264395 -0.001577 0.1419817 0.2079 0.1731962 0.7697954 -0.1057434 -0.0225145 -0.156517 0.0980113 -0.0840719 -0.0255478 -0.0259542 -0.0529379 -0.175566 0.9795512 -0.7189831 -0.2678424 -0.3603266 0.3959597 0.0884475 -0.1015132 0.0960604 0.2773115 -0.0067137 0.4003817 0.1401155 0.9273727 0.919533 0.2151019 0.3396434 0.2866964 -0.0361879 1.0087932 -0.0359431 -0.1024629 -0.4238489 0.0884737 -0.0038411 -0.2521231 -0.0446734 0.2361655 0.4435198 0.1069171 0.5854579 0.1417618 -0.0177751 0.1717891 0.778753 0.1354499 0.7828671 -0.1501937 -0.0056091 -0.1279121 -0.0261166 -0.0868614 0.008448 -0.1793669 0.0185253 -0.1170873 -0.0400992 -0.0272433 -0.109629 -0.0419871 -0.0914634 -0.010025 -0.1421613 -0.0057137 -0.1437022 0.0942068 0.0441235 0.0135535 0.0328351 0.0392147 -0.0204738 0.0041346 -0.0450916 0.1015879 0.0888817 0.0123825 0.0320385 0.0071583 0.1139896 -0.0443246 0.0468972 -0.0190756 0.0448581 0.073055 0.0157321 0.0183934 0.0275082 0.1484808 -0.0354721 0.0334253 -0.0412056 0.0072994 -0.0142946 0.0147365 -0.0035932 0.0099758 0.1599692 -0.021004 -0.0142764 -0.0150563 0.099451 unknown
polarizability: 268.447946|13.3541893|159.5266537|12.8215576|42.3199401|145.2452954 unknown
InChI: InChI=1S/C12H4Cl4O2/c13-5-1-2-8(14)6(3-5)7-4-9(15)11(17)12(18)10(7)16/h1-4H
charge 0 multiplicity 1
22 atoms
Cl 0.101632 -2.69688 -0.800892
Cl -0.903164 0.687504 2.846752
Cl 3.265556 2.810522 0.643802
Cl -4.40217 -0.326952 -2.438979
O  3.074709 -2.202686 -0.920104
O  4.471486 0.158084 -0.340284
C  0.281333 -0.0232 0.010844
C  -1.203729 0.065105 0.117849
C  0.954729 -1.149767 -0.423873
C  1.040597 1.194295 0.344661
C  -1.862991 0.436988 1.317815
C  -2.008216 -0.174372 -1.030038
C  2.431344 -1.186896 -0.557042
C  2.403578 1.279802 0.238382
C  3.223461 0.135269 -0.21381
C  -3.402922 -0.029546 -0.952611
C  -3.262183 0.57182 1.393808
C  -4.047937 0.342531 0.244047
H  0.465473 2.064809 0.672648
H  -1.53375 -0.459937 -1.972425
H  -3.736266 0.845872 2.339998
H  -5.135371 0.446932 0.285156
