program: Gaussian 09
title: 000186796
version: EM64L-G09RevD.01
frameworkgroup: C1[X(C4H6N2O3)]
method: RPBEPBE
basis: SDD
operation: Freq
keyword: #pfreq=noraman
keyword: PBEPBE/SDD
title: #p freq=noraman PBEPBE/SDD
converged: NO YES NO NO
title: Mulliken charges:
elementType: O O O N N C C C C H H H H H H
charge: -0.215846 -0.198185 -0.266470 -0.085519 0.070548 -0.411105 -0.272240 -0.444337 0.233199 0.257503 0.280166 0.242527 0.243144 0.292557 0.274057
chargesum: 0.00000
title: Mulliken charges with hydrogens summed into heavy atoms:
elementType: O O O N N C C C C
charge: -0.215846 -0.198185 -0.266470 -0.085519 0.070548 0.126563 0.213431 0.122278 0.233199
polarizability: 9.05808934e+01 -5.62260830e+00 6.79080075e+01 5.22529696e+00 1.16270589e+00 4.35732771e+01
1716.lowfreq: -4.6873 -0.0006 -0.0005 0.0004 11.1264 12.9364 54.0890 96.4696 172.9744
frequency: 53.9519 96.4660 172.9740 262.9966 295.3627 342.4487 385.3195 416.0001 480.4321 523.3295 601.8515 709.4791 732.3302 783.7660 892.3672 944.2936 947.6334 1008.0682 1048.9697 1091.1479 1135.1533 1185.0610 1215.3741 1247.7387 1301.0562 1318.3924 1328.3780 1352.3337 1373.0021 1442.8752 1454.1712 1470.6659 1669.9486 2982.3173 3002.2665 3031.0344 3071.1060 3082.0611 3113.9586
redmass: 5.6892 4.7632 3.1488 4.3540 3.6903 3.5921 6.7132 7.7412 4.8517 3.4386 4.5100 2.9181 5.1229 4.0298 3.5667 3.0278 2.2040 2.5568 2.8756 2.1769 3.8272 1.2549 1.3985 2.1329 1.5701 1.8804 1.5037 1.7597 2.0181 1.0786 1.0874 1.0889 12.3111 1.0669 1.0599 1.0620 1.1011 1.0932 1.1071
irintensity: 14.0713 2.5906 12.7304 11.4677 0.8138 2.9816 0.2313 3.5905 1.9563 6.7150 4.0133 12.9530 21.8242 20.1262 8.7281 153.0432 10.0932 94.6671 25.7502 62.2841 164.7323 13.5839 30.2344 36.0219 45.8683 39.3323 10.8433 62.7849 33.7667 14.9757 20.1477 7.8442 301.6563 14.6953 19.0443 27.7730 9.9989 1.5772 14.3860
temp: 298.150 k
press: 1.00000 atm
elementType: 8 8 8 7 7 6 6 6 6 1 1 1 1 1 1
symmnumber: 1
zpe: 284508.3 jmol-1
zpe.correction: 0.108364 hartree
zpe.thermalcorrener: 0.116525 hartree
zpe.thermalcorrenthalpy: 0.117469 hartree
zpe.thermalcorrgfe: 0.074843 hartree
zpe.sumelectzpe: -490.426561 hartree
zpe.sumelectthermal: -490.418400 hartree
zpe.sumelectthermalent: -490.417455 hartree
zpe.sumelectthermalfe: -490.460082 hartree
dipole: -0.7711 2.2154 1.5753
dipole: 2.8256
quadrupole: -78.7772 -47.2578 -48.6170
quadrupole: -1.7233 -0.8769 -0.7950
quadrupole: -20.5599 10.9596 9.6003 -1.7233 -0.8769 -0.7950
hfenergy: -490.5349244 hartree
pointgroup: C01 [X(C4H6N2O3)]
dipole: 0.2532123 0.9158969 -0.5769346 debye
dipolederiv: -0.5254461 -0.0339655 0.0606767 -0.4763044 -1.2842142 -0.1516444 0.0164997 -0.1179274 -0.3317099 -1.00637 -0.3813238 0.0052425 -0.2825509 -0.7626429 -0.0380376 0.0116789 -0.0317102 -0.3410934 -1.0873356 0.0963215 -0.2458248 -0.7158365 -0.264907 -0.1709343 -0.1222452 0.0505194 -0.2402004 -0.8998298 -0.0196474 -0.1603995 0.4174354 -0.2224256 0.0604839 -0.1970227 -0.0434706 -0.3059271 1.5382019 -0.1594023 0.5033898 0.1992448 -0.022033 0.0160004 0.4776325 -0.0621533 0.097565 -0.2094065 -0.0345997 -0.0475 -0.1088258 0.1165886 -0.062995 -0.0081252 -0.0351029 0.2420498 0.5790979 0.2569909 0.0670955 0.2110633 0.4682996 0.087341 -0.0487326 0.0400147 0.3008189 0.0954741 0.2654543 0.0870032 0.3558715 0.054775 0.0503413 0.0745869 0.0335282 0.236455 1.2776943 0.174166 -0.1152455 0.4437215 1.682044 0.1613006 -0.0973137 0.1645241 0.2790801 0.0957034 0.0472287 -0.0561693 0.0905647 0.0359311 -0.0182674 -0.0276072 0.0257106 -0.0994669 0.0660707 -0.1366267 0.0058384 0.0036104 0.100661 -0.0005598 -0.0056057 -0.0303984 0.1240942 -0.0062843 -0.0941754 -0.0443209 -0.029414 0.0552171 0.0275235 -0.0366414 -0.0459354 -0.1004006 0.0051104 0.0428059 -0.0273634 0.0231804 -0.099925 0.0254047 0.0017385 0.0585866 0.0962548 0.084342 0.0170802 -0.0174548 -0.0472354 0.060697 0.0463353 0.0004381 0.0739241 0.0816379 -0.0070224 -0.0403066 -0.0149681 -0.084525 0.0819343 -0.0322922 -0.0392808 -0.0801094 -0.0391573 unknown
polarizability: 89.0907493|7.138632|68.9682961|7.1810482|0.4725913|44.0031325 unknown
InChI: InChI=1S/C4H6N2O3/c7-4-3-6(5-8)1-2-9-4/h1-3H2
charge 0 multiplicity 1
15 atoms
O  -1.702681 0.917964 0.140378
O  -2.674309 -1.141484 -0.039099
O  3.013838 0.101902 0.384662
N  0.87629 -0.207031 -0.252156
N  2.04983 -0.739404 0.278138
C  0.68122 1.212716 -0.591244
C  -0.463949 1.746228 0.275806
C  -0.267785 -1.115266 -0.366817
C  -1.630375 -0.467412 -0.052564
H  0.451832 1.317985 -1.668133
H  1.628906 1.736802 -0.36981
H  -0.182572 1.75146 1.343678
H  -0.776791 2.755899 -0.032338
H  -0.114247 -1.970544 0.312389
H  -0.354804 -1.523216 -1.39439
