program: Gaussian 09
title: 000186848
version: EM64L-G09RevD.01
frameworkgroup: C1[X(C26H18N)]
method: RPBEPBE
basis: SDD
operation: Freq
keyword: #p
keyword: freq=noraman
keyword: PBEPBE/SDD
title: #p freq=noraman PBEPBE/SDD
converged: YES YES NO NO
title: Mulliken charges:
elementType: N C C C C C C C C C C C C C C C C C C C C C C C C C C H H H H H H H H H H H H H H H H H H
charge: -0.071223 -0.032463 0.394068 -0.027639 0.250839 -0.018423 0.326861 0.171419 0.480296 0.483671 -0.638247 -0.466033 -0.429554 -0.510684 -0.506790 -0.404269 -0.364501 -0.447207 -0.442414 -0.239268 -0.277616 -0.264176 -0.086600 -0.120370 -0.203556 -0.180670 -0.134477 0.304272 0.301545 0.217601 0.238266 0.249738 0.255590 0.224016 0.243031 0.256746 0.260256 0.248425 0.244846 0.251055 0.324430 0.292471 0.280318 0.278682 0.287739
chargesum: 1.00000
title: Mulliken charges with hydrogens summed into heavy atoms:
elementType: N C C C C C C C C C C C C C C C C C C C C C C C C C C
charge: -0.071223 -0.032463 0.394068 -0.027639 0.250839 -0.018423 0.326861 0.171419 0.480296 0.483671 -0.032429 -0.248432 -0.191287 -0.260947 -0.251200 -0.180253 -0.121470 -0.190460 -0.182158 0.009157 -0.032770 -0.013121 0.237830 0.172101 0.076762 0.098012 0.153261
polarizability: 4.61912713e+02 5.35770307e+01 3.50064942e+02 -3.25379402e+01 1.73018174e+01 1.60862160e+02
1716.lowfreq: -7.8094 -4.9019 0.0004 0.0005 0.0007 2.6896 3.0807 24.2279 33.2033
frequency: -1.6419 24.1505 33.1799 58.5937 79.0036 126.5245 152.4224 176.0042 190.8409 207.4261 224.7227 259.3895 293.8940 329.4802 340.7108 360.8518 391.0230 394.6753 409.1823 442.6067 457.0372 463.8840 489.7992 509.3723 510.4975 517.8944 525.0025 544.7064 564.9071 572.6425 582.8301 629.3386 640.5277 643.8254 687.6146 695.5999 699.2021 716.3482 726.7493 740.7543 766.5000 775.8645 776.6311 788.3387 797.5812 815.4687 838.9402 857.7521 870.6915 872.4570 873.1133 921.9987 929.9184 955.0711 955.6750 971.8593 980.9604 988.9878 994.2132 999.2414 1004.3121 1008.0922 1010.2149 1023.2040 1024.1519 1050.0740 1053.0622 1065.7463 1073.2529 1084.2959 1096.5165 1128.9308 1146.4216 1174.0661 1182.5311 1188.1013 1192.7277 1209.7173 1211.3754 1227.7959 1239.7196 1262.5882 1267.9478 1284.6979 1293.3948 1322.6030 1350.0633 1356.6854 1376.2655 1377.7322 1399.1392 1404.1047 1418.6573 1427.6716 1432.4933 1441.4990 1463.6734 1466.4240 1472.4648 1480.2524 1490.8860 1497.1467 1520.3251 1556.8345 1573.6570 1587.0460 1589.8297 1603.7759 1617.0307 1623.3465 1634.1543 3034.5723 3093.1562 3124.8637 3125.6858 3136.3315 3140.2549 3143.1832 3148.8002 3149.9357 3162.0257 3170.0158 3174.6738 3174.7754 3179.9544 3184.4303 3185.2001 3196.9596 3204.3222
redmass: 4.0929 4.8940 5.0683 5.0927 4.3797 4.2155 4.5429 4.4781 4.2641 4.7130 4.3048 5.3666 4.3858 6.5455 4.3486 2.8363 4.9692 2.7330 3.9024 2.8656 4.3616 3.4028 5.9981 5.6075 3.8559 3.4748 6.8851 4.1920 3.2071 4.1260 5.5211 6.3200 6.1993 5.5983 2.2393 5.0596 3.7203 3.1348 5.2361 2.8006 1.4788 1.6867 1.2701 2.4231 4.1114 3.6852 1.7157 1.7691 1.6032 3.0786 1.9260 3.3966 1.4367 1.6132 1.4193 1.7085 1.6780 1.4388 1.6743 1.4021 1.5025 2.5130 5.7428 5.7372 1.3764 2.7445 2.2983 2.9844 2.8511 2.1004 1.9179 2.5424 1.9562 1.3571 1.0643 1.2545 1.1362 1.2579 1.1900 1.2344 1.6295 1.6906 1.7255 1.9979 1.9082 2.3382 1.4091 3.2303 2.6644 3.6834 3.9659 2.7731 3.2813 3.3061 2.9100 4.1473 2.1546 1.7318 2.9135 2.1501 2.0211 3.4977 3.4644 6.1858 5.8820 7.9447 5.5294 6.4910 5.9356 5.1320 7.0841 1.0597 1.1038 1.0857 1.0859 1.0879 1.0898 1.0918 1.0895 1.0971 1.0942 1.0989 1.0903 1.0981 1.0908 1.0940 1.0951 1.0980 1.1031
irintensity: 0.3284 0.6228 0.9229 0.4511 0.5243 1.6550 0.1650 3.6182 4.6462 3.4325 1.9483 1.0178 0.1149 1.3661 0.2908 1.6635 0.7858 0.1038 2.1666 4.5723 0.1315 2.5311 4.3797 2.6200 2.1859 2.9254 0.5264 11.4278 2.4196 2.1568 1.4597 3.0070 0.9902 0.3364 32.0125 1.1281 2.0057 24.2167 42.7683 13.8914 52.7140 93.2316 13.0233 4.4880 2.2073 19.9279 14.2294 1.4787 5.3356 22.9436 54.7335 6.4066 0.1632 7.2705 0.8928 5.1302 0.3626 0.2815 2.6446 0.0224 1.1960 4.6078 30.4035 1.6849 0.1984 1.7975 2.7117 183.7784 27.2600 4.1966 5.6761 4.2151 3.6398 5.7882 2.5368 1.0757 4.5576 14.3670 43.4587 0.6395 1.8794 24.1324 21.5870 57.9151 3.1280 1.3159 5.5106 11.8706 4.5381 12.5732 6.8878 2.7161 4.2253 1.3499 6.1685 0.5364 52.7688 9.4115 2.3515 78.7269 8.7682 3.2700 2.4237 9.0656 16.9177 36.2932 40.4258 8.7956 10.5555 14.9767 27.4651 23.6892 0.7454 1.0544 21.2324 0.4771 1.1828 6.2605 8.0071 34.6725 12.3985 21.3617 2.2406 9.9144 3.9452 24.1528 13.5763 4.3390 2.9609
temp: 298.150 k
press: 1.00000 atm
elementType: 7 6 6 6 6 6 6 6 6 6 6 6 6 6 6 6 6 6 6 6 6 6 6 6 6 6 6 1 1 1 1 1 1 1 1 1 1 1 1 1 1 1 1 1 1
symmnumber: 1
zpe: 944214.4 jmol-1
zpe.correction: 0.359632 hartree
zpe.thermalcorrener: 0.377885 hartree
zpe.thermalcorrenthalpy: 0.378829 hartree
zpe.thermalcorrgfe: 0.313064 hartree
zpe.sumelectzpe: -1054.362876 hartree
zpe.sumelectthermal: -1054.344624 hartree
zpe.sumelectthermalent: -1054.343680 hartree
zpe.sumelectthermalfe: -1054.409445 hartree
dipole: 10.3253 -4.4842 1.3218
dipole: 11.3344
quadrupole: -53.0310 -114.0604 -144.2796
quadrupole: -20.3034 -1.7571 3.2230
quadrupole: 50.7593 -10.2700 -40.4893 -20.3034 -1.7571 3.2230
hfenergy: -1054.7225086 hartree
pointgroup: C01 [X(C26H18N1)]
dipole: 3.9436755 -2.0198399 0.5028837 debye
polarizability: 468.3955004|46.8201874|343.0844503|-28.6659459|23.2009274|161.359864 unknown
InChI: InChI=1S/C26H18N/c1-4-15-27(16-5-1)17-24-21-10-3-2-9-20(21)22-13-11-18-7-6-8-19-12-14-23(24)26(22)25(18)19/h1-16H,17H2
charge 1 multiplicity 1
45 atoms
N  3.1277 -1.241482 -0.317961
C  -1.414541 0.196855 -0.178719
C  -0.247379 -0.549219 -0.630366
C  0.998298 0.120576 -0.79007
C  -1.30992 1.599196 0.115652
C  -2.682789 -0.475163 -0.040134
C  1.133035 1.521954 -0.454547
C  -0.024216 2.26941 -0.002936
C  -2.806118 -1.882397 -0.323052
C  -3.850366 0.253746 0.383784
C  2.174963 -0.611058 -1.370423
C  -0.411119 -1.969435 -0.891642
C  -2.497381 2.301258 0.534341
C  -1.628747 -2.60397 -0.746288
C  -3.718318 1.657945 0.662156
C  2.395858 2.204675 -0.539616
C  0.139271 3.657419 0.311987
C  -4.062511 -2.524409 -0.181229
C  -5.098156 -0.423273 0.51298
C  -5.202396 -1.797906 0.233317
C  2.519853 3.558045 -0.221331
C  1.377026 4.295147 0.205869
C  2.875417 -1.113143 1.021855
C  4.230006 -1.926866 -0.769334
C  3.743938 -1.687552 1.965515
C  5.12372 -2.516878 0.13355
C  4.881675 -2.398613 1.524176
H  2.814846 0.055059 -1.972213
H  1.865418 -1.448369 -2.014804
H  0.448121 -2.57069 -1.206449
H  -2.447679 3.369387 0.755896
H  -1.719418 -3.676552 -0.953099
H  -4.604267 2.219011 0.979677
H  3.295151 1.666756 -0.858807
H  -0.718637 4.244344 0.647989
H  -4.145359 -3.595204 -0.39889
H  -5.980363 0.142107 0.833081
H  -6.165928 -2.306361 0.335685
H  3.492123 4.055465 -0.299069
H  1.471825 5.357177 0.452294
H  1.977091 -0.551217 1.286809
H  4.361556 -1.981619 -1.852909
H  3.521568 -1.571212 3.028572
H  5.991668 -3.058118 -0.250048
H  5.567482 -2.852026 2.245453
