program: Gaussian 09
title: 000184763
version: EM64L-G09RevD.01
frameworkgroup: C1[X(C14H11Cl3F2N2O)]
method: RPBEPBE
basis: SDD
operation: Freq
keyword: #p
keyword: freq=noraman
keyword: PBEPBE/SDD
title: #p freq=noraman PBEPBE/SDD
converged: NO YES NO NO
title: Mulliken charges:
elementType: Cl Cl Cl F F O N N C C C C C C C C C C C C C C H H H H H H H H H H H
charge: 0.015991 0.010304 0.027002 -0.149855 -0.191950 -0.216517 -0.229885 -0.083636 -0.411674 -0.404139 -0.506066 -0.457120 0.412801 -0.001649 -0.363304 0.699862 -0.500072 -0.363136 0.494661 -0.177533 -0.350740 0.156579 0.212040 0.209664 0.213527 0.211182 0.228318 0.230707 0.228740 0.238678 0.311019 0.286290 0.219908
chargesum: 0.00000
title: Mulliken charges with hydrogens summed into heavy atoms:
elementType: Cl Cl Cl F F O N N C C C C C C C C C C C C C C
charge: 0.015991 0.010304 0.027002 -0.149855 -0.191950 -0.216517 -0.229885 -0.083636 0.010030 0.020570 -0.047042 0.010298 0.412801 -0.001649 -0.363304 0.699862 -0.189053 -0.363136 0.494661 0.108758 -0.350740 0.376488
polarizability: 2.84628171e+02 -1.14932903e+01 1.92065199e+02 2.81683895e+00 -8.34714682e+00 1.31854934e+02
1716.lowfreq: -3.5210 0.0020 0.0024 0.0030 3.2660 6.3917 20.7339 33.2528 34.2635
frequency: 20.7319 33.2038 34.2451 46.0171 60.4297 84.1409 97.4874 112.6026 128.2420 146.3059 161.7426 171.3635 192.7896 222.4746 246.5486 254.6890 268.7935 301.4424 311.9015 349.7359 371.7134 404.5353 411.1075 432.0024 451.7095 469.1299 479.4782 510.4907 536.4699 553.0082 591.1066 632.1285 649.2674 661.8277 664.0228 676.0500 708.8956 729.4255 748.4160 818.4802 850.8933 860.3675 888.8526 893.3639 905.3436 916.2549 942.6609 967.4189 991.6874 1026.5166 1043.6331 1051.4700 1077.9977 1082.2977 1091.3352 1134.4895 1154.0753 1164.0732 1196.2319 1230.2350 1238.5700 1247.0702 1250.6310 1289.4397 1308.2214 1313.2458 1319.0754 1323.9344 1340.8723 1343.9948 1369.0853 1378.1829 1423.8510 1452.1149 1459.4497 1471.1445 1474.2378 1477.4293 1491.4630 1568.3695 1578.2315 1595.7229 2972.2604 2979.5541 2983.2117 2986.4592 3029.0804 3045.7470 3049.4163 3055.0978 3057.4313 3176.5682 3183.7495
redmass: 8.2169 6.7310 10.2972 11.5907 11.8860 6.6658 3.4629 6.4805 7.4181 12.5847 12.5125 9.8168 7.1100 5.6068 6.1410 4.1169 8.7782 6.6322 2.0897 5.0886 10.1102 7.1675 10.1192 5.0088 5.0777 2.8718 6.4013 6.9830 6.1680 6.6049 9.2704 6.6000 6.5213 8.7928 4.7830 3.2254 4.2795 4.9085 6.3377 1.6004 2.4305 1.4733 1.6818 3.8719 1.4827 8.6850 3.2010 2.3696 5.5850 8.9457 5.3729 5.7933 2.6509 2.3959 1.9637 1.1465 1.4897 2.4224 3.4467 5.3416 1.2908 1.2408 1.3512 1.1871 1.6643 1.3804 1.7462 2.6171 1.4289 1.4564 8.8348 4.7557 4.6342 1.6300 1.1123 1.1085 1.3574 1.5770 5.0006 10.2764 10.5918 7.3262 1.0633 1.0658 1.0651 1.0607 1.0963 1.0952 1.0990 1.0883 1.1035 1.0928 1.0933
irintensity: 0.5397 0.1905 0.3487 0.8447 3.0378 0.3565 0.2585 0.6444 2.5551 0.3783 0.8124 0.4317 1.0104 1.1586 2.6346 1.0604 2.8660 0.2687 1.8668 2.2086 1.8065 2.5780 14.2866 1.3415 9.9400 0.9123 9.3682 5.2859 2.3133 5.6555 11.0753 7.3419 4.1789 7.9845 1.7540 5.5673 6.1939 17.3853 17.6268 5.2780 6.6792 6.1441 48.3997 9.0941 4.6774 221.0368 16.8160 17.6649 37.9944 36.4283 566.2754 78.9007 10.6146 5.8954 3.8200 0.9768 7.2312 22.8966 79.9329 111.7874 6.9510 2.7207 6.6924 14.8568 4.1489 101.3970 4.3892 10.0781 1.1176 2.8361 1.7864 85.5157 49.1347 31.5339 7.5554 16.8321 22.4966 64.3457 254.6399 32.1469 7.4166 13.9083 26.1887 22.2712 31.0395 33.4160 27.9430 26.2630 66.0077 29.0331 54.9482 3.6558 0.9775
temp: 298.150 k
press: 1.00000 atm
elementType: 17 17 17 9 9 8 7 7 6 6 6 6 6 6 6 6 6 6 6 6 6 6 1 1 1 1 1 1 1 1 1 1 1
symmnumber: 1
zpe: 594820.7 jmol-1
zpe.correction: 0.226555 hartree
zpe.thermalcorrener: 0.246867 hartree
zpe.thermalcorrenthalpy: 0.247811 hartree
zpe.thermalcorrgfe: 0.174598 hartree
zpe.sumelectzpe: -2303.047363 hartree
zpe.sumelectthermal: -2303.027052 hartree
zpe.sumelectthermalent: -2303.026108 hartree
zpe.sumelectthermalfe: -2303.099321 hartree
dipole: -3.8162 -0.8632 1.9184
dipole: 4.3576
quadrupole: -143.6303 -150.2154 -146.7981
quadrupole: -13.6978 3.6889 4.1170
quadrupole: 3.2510 -3.3341 0.0832 -13.6978 3.6889 4.1170
hfenergy: -2303.2739187 hartree
pointgroup: C01 [X(C14H11Cl3F2N2O1)]
dipole: 1.4530292 0.0169322 0.9097328 debye
polarizability: 284.7328973|-12.1706012|178.0196268|1.123716|26.3474677|145.7957807 unknown
InChI: InChI=1S/C14H11Cl3F2N2O/c15-8-5-9(16)12(22-14(18)19)6-11(8)21-13(17)7-3-1-2-4-10(7)20-21/h5-6,14H,1-4H2
charge 0 multiplicity 1
33 atoms
Cl 1.435068 0.854696 2.807474
Cl 0.233607 3.421933 0.692807
Cl -4.984637 1.722889 0.059715
F  -4.735862 -2.926809 -0.366827
F  -2.659224 -2.861477 -1.301757
O  -3.758831 -0.913224 -0.594169
N  0.928795 0.420651 0.091256
N  1.510316 -0.067147 -1.101709
C  5.321176 -1.131998 0.374209
C  5.252943 -0.69212 -1.111406
C  4.421112 -0.246841 1.279984
C  3.831161 -0.888342 -1.704062
C  3.07493 -0.05266 0.629323
C  2.802886 -0.33453 -0.751427
C  1.860054 0.414755 1.128151
C  -0.455937 0.758711 0.106375
C  -1.392516 -0.245165 -0.235639
C  -0.921473 2.066188 0.38505
C  -2.771051 0.040747 -0.242885
C  -2.299588 2.359339 0.374276
C  -3.223272 1.346418 0.064878
C  -3.502009 -2.264605 -0.29668
H  6.365321 -1.083004 0.735484
H  5.000206 -2.190052 0.452815
H  5.981262 -1.270737 -1.709538
H  5.543687 0.374465 -1.189824
H  4.908054 0.73767 1.432505
H  4.315558 -0.699531 2.284212
H  3.642854 -1.969055 -1.863815
H  3.741493 -0.403068 -2.692932
H  -1.013718 -1.227553 -0.53082
H  -2.649154 3.371371 0.591427
H  -3.02491 -2.432913 0.686349
