program: Gaussian 09
title: 000186772
version: EM64L-G09RevD.01
frameworkgroup: C1[X(C5H8N2O3)]
method: RPBEPBE
basis: SDD
operation: Freq
keyword: #pfreq=noraman
keyword: PBEPBE/SDD
title: #p freq=noraman PBEPBE/SDD
converged: YES YES NO NO
title: Mulliken charges:
elementType: O O O N N C C C C C H H H H H H H H
charge: -0.428392 -0.225217 -0.240671 -0.143978 -0.195864 -0.160314 0.195646 0.269018 -0.600076 -0.604574 0.244928 0.264099 0.227002 0.262157 0.251598 0.249601 0.265456 0.369580
chargesum: 0.00000
title: Mulliken charges with hydrogens summed into heavy atoms:
elementType: O O O N N C C C C C
charge: -0.058812 -0.225217 -0.240671 -0.143978 -0.195864 0.084614 0.195646 0.269018 0.153183 0.162081
polarizability: 8.50581764e+01 1.24894445e+00 9.22157937e+01 9.77700873e-01 -2.45479939e+00 4.90991541e+01
1716.lowfreq: -10.5502 -10.0734 -0.0011 -0.0009 -0.0005 8.0506 79.8658 84.1999 117.0839
frequency: 79.8474 84.1062 117.0680 132.4777 146.8790 173.7286 250.0486 256.6018 272.7363 299.0543 359.9892 452.8381 541.5672 571.1535 611.6411 693.0598 718.7533 802.9629 893.6044 944.1435 1004.3004 1055.0800 1085.8409 1126.5022 1132.1622 1165.6773 1231.4099 1246.6713 1295.5498 1308.2819 1373.0981 1392.5354 1437.0444 1444.4971 1473.4353 1474.4644 1483.7656 1493.6883 1655.6513 1715.6842 2969.9901 2987.5200 3002.9524 3076.8744 3094.6887 3117.1546 3122.1109 3535.1403
redmass: 6.8884 1.0595 1.1352 2.3239 6.1492 2.6450 2.6340 1.9307 3.3794 2.8788 8.1720 7.4048 5.2087 8.3756 4.9262 6.0226 8.1608 7.2645 3.2054 6.4691 2.5927 2.3166 4.1850 1.2761 1.2959 1.2022 1.9912 2.5117 2.5882 1.3772 4.6609 2.2912 1.3159 1.3635 1.0434 1.0427 1.0605 1.0956 11.0118 10.4572 1.0838 1.0361 1.0331 1.0998 1.1024 1.1007 1.1017 1.0658
irintensity: 7.3598 0.2327 1.5218 12.8889 1.9047 31.0243 3.9979 78.0074 7.7137 51.6064 43.9846 6.2199 14.0404 15.0043 6.8890 6.1903 11.5547 11.9027 22.9691 40.3542 171.4319 80.0692 24.2513 3.5673 1.6106 45.5379 23.3589 47.9203 3.8791 13.7984 77.8239 100.6332 68.0123 116.7137 6.1942 31.1859 18.3170 14.9273 594.3293 121.3823 42.0032 54.2142 26.8410 21.3266 17.8739 2.1041 0.7280 17.7407
temp: 298.150 k
press: 1.00000 atm
elementType: 8 8 8 7 7 6 6 6 6 6 1 1 1 1 1 1 1 1
symmnumber: 1
zpe: 358305.7 jmol-1
zpe.correction: 0.136471 hartree
zpe.thermalcorrener: 0.147110 hartree
zpe.thermalcorrenthalpy: 0.148054 hartree
zpe.thermalcorrgfe: 0.100232 hartree
zpe.sumelectzpe: -529.756333 hartree
zpe.sumelectthermal: -529.745694 hartree
zpe.sumelectthermalent: -529.744750 hartree
zpe.sumelectthermalfe: -529.792572 hartree
dipole: -0.8534 0.7578 -1.1109
dipole: 1.5927
quadrupole: -53.7050 -66.7601 -57.8917
quadrupole: -5.8969 3.8275 0.6596
quadrupole: 5.7472 -7.3078 1.5606 -5.8969 3.8275 0.6596
hfenergy: -529.8928041 hartree
pointgroup: C01[X(C5H8N2O3)]
dipole: 0.2779308 -0.3602603 -0.4308214 debye
dipolederiv: -0.3679409 0.2678477 0.0362625 0.2235909 -0.6666046 0.1405453 0.0561086 0.2738714 -0.6322966 -0.792225 -0.4314419 -0.0348099 -0.2670786 -0.8718634 -0.0340978 0.0231838 0.0086925 -0.350307 -0.5835585 -0.1618981 0.0041141 -0.0265817 -1.2351021 -0.0763217 0.011088 -0.0736892 -0.3588411 -0.9393882 0.1294211 0.0930487 0.387953 -0.9266498 -0.0110043 0.1030878 -0.0874149 -0.3741184 -1.0490109 -0.2120975 0.0514568 -0.4562231 -1.2138302 -0.0465942 0.0106278 -0.0772558 -0.1866691 0.0025032 0.1046165 0.0216279 0.0042939 0.9684885 -0.1405137 0.0281898 -0.2164614 0.7334459 0.7439031 0.3833102 -0.0027986 0.454341 1.5378402 0.0991056 -0.0101599 0.1120853 0.1385329 1.6493721 0.1814831 -0.0894553 -0.0515555 1.7568778 0.1444815 -0.1162236 0.1539393 0.2765497 0.5621203 -0.0247621 -0.0663798 0.0265556 0.0118048 -0.016059 -0.0572357 -0.0205951 0.2620764 0.3647563 -0.1478588 -0.0317071 -0.208744 0.1486706 0.0150422 -0.0336715 -0.0003265 0.2290554 0.0347814 0.0358146 0.0336447 0.0148715 -0.06943 -0.060848 -0.0004048 -0.0323806 -0.1419554 0.1007536 0.0162921 0.007164 -0.0944368 -0.0287772 -0.0163197 -0.0031126 -0.0231194 0.1304923 -0.0337395 0.0147224 0.0409278 0.0517624 0.096887 -0.0857511 0.1267272 -0.0608117 -0.1064505 -0.0180285 0.0364239 -0.0223013 0.0832436 0.0824729 0.0857358 -0.0797022 0.0711337 -0.0037362 0.0044055 0.0444174 0.059742 -0.0085611 0.0750944 0.0795376 0.0984113 0.0170719 -0.0552692 -0.0303232 0.0455852 -0.0630599 -0.0155063 0.0945608 -0.0580384 -0.1030583 -0.009671 -0.0242453 0.1317722 -0.080376 -0.0031749 0.0250121 -0.019215 -0.0099862 0.0068034 -0.003605 0.1313387 0.2198471 -0.2014997 -0.0343017 -0.1429368 0.2587754 -0.0089139 -0.060659 -0.0314636 0.3323976 unknown
polarizability: 85.4080236|2.1277267|91.9104357|-2.0705293|0.4522472|49.0546649 unknown
InChI: InChI=1S/C5H8N2O3/c1-6-3(8)4(9)7(2)5(6)10/h3,8H,1-2H3
charge 0 multiplicity 1
18 atoms
O  0.998107 -2.039375 0.803635
O  -1.902274 -1.690665 -0.137856
O  0.512763 2.350357 0.051822
N  1.189763 0.088508 -0.26521
N  -1.030428 0.519646 -0.032863
C  0.545427 -1.208023 -0.318867
C  -0.959693 -0.85825 -0.171972
C  0.282384 1.124631 -0.063822
C  2.640136 0.279767 -0.313709
C  -2.253773 1.294374 0.185963
H  0.743697 -1.735012 -1.275641
H  2.846217 1.353019 -0.174737
H  3.049217 -0.040519 -1.289967
H  3.129018 -0.295219 0.490813
H  -2.736095 0.998008 1.133033
H  -2.965168 1.128825 -0.640397
H  -1.972569 2.358553 0.229871
H  0.37847 -2.812425 0.883703
