program: Gaussian 09
title: 000184744
version: EM64L-G09RevD.01
frameworkgroup: C1[X(C13H15Cl2NO3Si)]
method: RPBEPBE
basis: SDD
operation: Freq
keyword: #p
keyword: freq=noraman
keyword: PBEPBE/SDD
title: #p freq=noraman PBEPBE/SDD
converged: YES YES NO NO
title: Mulliken charges:
elementType: Cl Cl Si O O O N C C C C C C C C C C C C C H H H H H H H H H H H H H H H
charge: -0.013844 -0.058625 1.388771 -0.547797 -0.231633 -0.231667 -0.016672 -0.554894 -1.024986 -1.037523 -0.677278 -0.137498 0.268790 -0.429169 0.563043 -0.346891 -0.267333 -0.118229 -0.179060 -0.257844 0.289782 0.254158 0.257640 0.265465 0.283229 0.252937 0.256006 0.279217 0.225460 0.234343 0.244439 0.280774 0.263411 0.261095 0.262383
chargesum: 0.00000
title: Mulliken charges with hydrogens summed into heavy atoms:
elementType: Cl Cl Si O O O N C C C C C C C C C C C C C
charge: -0.013844 -0.058625 1.388771 -0.547797 -0.231633 -0.231667 -0.016672 -0.265112 -0.247723 -0.245351 0.061742 -0.137498 0.268790 0.096044 0.563043 -0.346891 -0.003921 -0.118229 0.082035 0.004539
polarizability: 2.34031330e+02 4.93572487e+00 2.09964329e+02 2.43042265e+01 -2.74268167e+00 1.40567643e+02
1716.lowfreq: -15.2760 -7.9914 -1.4092 -0.0021 -0.0008 0.0009 6.2630 16.1581 18.5066
frequency: -9.8561 16.1025 17.7465 24.6838 57.8824 74.7636 81.6974 92.5420 108.3350 119.9555 127.3986 133.3008 148.6164 169.1194 181.8200 193.0077 200.3883 201.1278 226.5264 231.1606 255.1539 273.7908 299.4036 308.5482 312.1517 315.8760 370.2236 441.0421 445.9234 462.2776 513.9724 536.1890 545.7359 571.3318 586.4205 597.3865 629.8081 682.0790 687.0202 697.8379 713.1577 734.0433 797.5704 818.3640 827.9823 834.3255 838.2766 859.0661 885.0486 894.6723 919.8544 930.2247 989.5537 1001.0443 1011.3551 1037.4691 1042.9292 1085.9882 1099.5710 1133.6507 1160.1205 1185.0639 1216.0483 1243.0535 1254.9255 1265.5397 1311.8352 1324.8151 1335.1232 1377.1977 1385.9809 1401.3486 1437.0879 1442.6487 1445.9661 1448.1542 1453.9472 1460.9637 1482.9591 1490.1738 1567.7921 1599.5180 1634.4869 2172.2424 2986.6303 2991.1284 2997.0425 2998.1907 2999.8422 3090.8604 3092.6094 3095.9966 3102.6705 3103.6086 3107.5632 3111.3338 3165.6571 3180.1117 3188.0527
redmass: 4.6109 9.1939 6.8325 6.2450 7.9467 4.8061 6.8080 11.2769 4.0732 1.0911 1.8175 2.0662 2.6400 4.0263 3.8395 5.6006 3.6664 3.9505 1.6093 2.1838 4.0635 5.8419 4.8234 7.6832 9.2165 4.1144 5.5386 3.1211 6.9140 7.1075 6.4997 3.1654 4.7647 5.0350 6.7181 4.6105 7.3236 6.2651 5.5036 3.5096 5.4239 2.4072 1.3316 1.2740 4.0273 1.7940 1.9323 2.7045 4.0318 1.6297 1.5039 1.3350 1.3201 2.3449 6.7592 3.9762 6.6792 1.8963 1.4929 1.3733 3.7032 1.4344 1.4468 2.1389 1.3352 1.3332 1.1976 1.1918 1.4595 7.1977 3.6187 1.1660 1.0504 1.0530 1.0474 1.0972 1.0496 2.7639 1.0437 1.0461 7.0111 8.7652 10.0709 12.4868 1.0812 1.0349 1.0350 1.0347 1.0648 1.0978 1.0968 1.1011 1.0981 1.0987 1.0992 1.1014 1.0894 1.0916 1.0972
irintensity: 0.3827 0.2868 1.5324 3.0983 0.9452 0.3950 5.0368 0.1554 5.6178 0.7013 0.0324 0.2937 1.2174 1.3691 1.9925 1.2549 2.6888 5.9653 0.9324 4.7974 9.2070 4.5889 16.0495 0.4491 4.2152 4.9805 5.9752 11.4717 12.1975 6.8879 5.5412 6.3758 0.9281 10.4613 23.2713 11.8605 57.6884 11.8390 8.3870 0.4769 28.8511 8.9263 33.9978 0.4564 31.0695 54.3166 69.7328 1.2887 5.0847 265.1674 116.9475 0.1420 27.9804 14.2485 68.2803 7.1361 189.4429 27.7094 11.6870 19.1871 579.5306 21.4461 18.0061 30.3223 10.8989 0.9951 46.4018 36.1198 27.8495 30.3876 33.6459 20.7204 4.6564 0.5021 14.4266 39.9492 23.2334 155.7938 9.3594 10.8347 21.1213 72.4643 177.8702 32.4960 1.5896 2.6452 3.7290 22.5455 24.1674 7.7974 6.2029 20.5819 5.6916 8.6814 2.7968 2.1408 1.0089 3.7809 0.2836
temp: 298.150 k
press: 1.00000 atm
elementType: 17 17 14 8 8 8 7 6 6 6 6 6 6 6 6 6 6 6 6 6 1 1 1 1 1 1 1 1 1 1 1 1 1 1 1
symmnumber: 1
zpe: 662137.7 jmol-1
zpe.correction: 0.252195 hartree
zpe.thermalcorrener: 0.274794 hartree
zpe.thermalcorrenthalpy: 0.275738 hartree
zpe.thermalcorrgfe: 0.197351 hartree
zpe.sumelectzpe: -1992.857698 hartree
zpe.sumelectthermal: -1992.835100 hartree
zpe.sumelectthermalent: -1992.834156 hartree
zpe.sumelectthermalfe: -1992.912542 hartree
dipole: -1.0807 1.7098 1.7405
dipole: 2.6684
quadrupole: -166.9486 -142.3648 -135.1371
quadrupole: 2.5602 8.0169 -0.8633
quadrupole: -18.7984 5.7854 13.0131 2.5602 8.0169 -0.8633
hfenergy: -1993.1098933 hartree
pointgroup: C01 [X(C13H15Cl2N1O3Si1)]
dipole: 0.4768414 -0.878296 0.3215358 debye
polarizability: 231.9497235|17.2715148|196.5212593|-21.8526884|27.5891394|156.092319 unknown
InChI: InChI=1S/C13H15Cl2NO3Si/c1-9(7-16)20(2,3)19-13(17)8-18-12-6-10(14)4-5-11(12)15/h4-6,9H,8H2,1-3H3
charge 0 multiplicity 1
35 atoms
Cl 3.88811 2.830977 1.070864
Cl 3.310475 -2.888946 -1.787619
Si -3.160438 -0.910247 0.051093
O  -1.682533 -0.560202 1.036011
O  1.65229 0.934868 1.436184
O  -0.490205 0.778697 -0.449803
N  -6.674339 0.37999 -0.361945
C  -4.044449 0.802922 -0.273906
C  -4.149699 -1.998309 1.2357
C  -2.623816 -1.752581 -1.557601
C  -3.541198 1.533037 -1.55713
C  -5.497558 0.586337 -0.313522
C  -0.588205 0.175605 0.6410
C  0.469527 0.152442 1.753102
C  2.581033 0.417093 0.529699
C  3.723132 1.218059 0.264677
C  2.465512 -0.843789 -0.105385
C  3.485551 -1.263171 -0.978791
C  4.727093 0.778539 -0.6138
C  4.619804 -0.48022 -1.251371
H  -3.822903 1.432884 0.612779
H  -3.59056 -2.920021 1.473895
H  -4.352643 -1.467241 2.182142
H  -5.120314 -2.283325 0.793071
H  -1.948503 -1.101852 -2.138183
H  -2.096294 -2.699124 -1.343096
H  -3.50415 -1.990256 -2.182765
H  -2.448676 1.670711 -1.506284
H  -3.778146 0.948843 -2.4630
H  -4.024106 2.520836 -1.652591
H  0.714036 -0.896491 2.010667
H  0.041109 0.629265 2.649726
H  1.596942 -1.486065 0.05583
H  5.595304 1.416479 -0.80176
H  5.396422 -0.828245 -1.936289
