program: Gaussian 09
title: 000186751
version: EM64L-G09RevD.01
frameworkgroup: C1[X(C14H20N2)]
method: RPBEPBE
basis: SDD
operation: Freq
keyword: #pfreq=noraman
keyword: PBEPBE/SDD
title: #p freq=noraman PBEPBE/SDD
converged: YES YES NO NO
title: Mulliken charges:
elementType: N N C C C C C C C C C C C C C C H H H H H H H H H H H H H H H H H H H H
charge: -0.475858 -0.096721 -0.209768 0.426937 -0.360999 0.295789 -0.563697 0.186885 -0.698892 -0.633694 -0.372723 0.450243 -0.620533 -0.626819 -0.349573 -0.827628 0.211690 0.200730 0.211347 0.258126 0.296824 0.258270 0.188852 0.217953 0.239182 0.225386 0.220193 0.228215 0.188404 0.191165 0.224770 0.222087 0.223157 0.222032 0.224338 0.224331
chargesum: 0.00000
title: Mulliken charges with hydrogens summed into heavy atoms:
elementType: N N C C C C C C C C C C C C C C
charge: -0.179034 -0.096721 0.001922 0.426937 0.051078 0.295789 -0.305571 0.186885 -0.033817 -0.394512 -0.147337 0.450243 0.016278 0.011204 -0.126416 -0.156927
polarizability: 2.53392032e+02 7.08915664e+00 1.57216172e+02 -2.22569273e+00 4.53591856e+00 1.02492558e+02
1716.lowfreq: -3.6545 -0.0003 -0.0002 0.0007 6.3548 10.2713 17.7504 32.0737 58.1709
frequency: 17.4260 31.4624 58.1384 65.5745 81.5115 106.1137 165.7448 192.2318 210.9067 218.0610 233.1408 235.1375 240.7620 289.3660 318.6853 330.6704 375.9066 389.2520 423.4520 427.3017 458.3817 484.7983 504.3434 511.2921 596.1807 600.5768 650.5763 697.1758 750.1674 753.1275 794.0937 802.3078 819.9005 823.1240 873.4967 886.5849 912.2960 932.1838 933.1452 964.2177 1000.4173 1030.0082 1034.1351 1039.4043 1046.6594 1083.0092 1090.8211 1119.3413 1137.2397 1139.9950 1150.4075 1172.8119 1191.9074 1227.2634 1234.1074 1258.5669 1271.3068 1281.9906 1304.0797 1314.8027 1325.7074 1363.6293 1379.3091 1383.3158 1396.5359 1417.6568 1419.4889 1440.6635 1457.2093 1460.8523 1461.7342 1466.7441 1469.4392 1470.4226 1475.1610 1479.4499 1484.3289 1485.4666 1495.3889 1556.1424 1595.0765 1637.4711 2847.3886 2851.9282 2867.5926 2943.0385 2969.3519 2977.8883 3018.3478 3021.2981 3026.8559 3045.2195 3071.3251 3076.7353 3077.3189 3082.5917 3092.4013 3115.3958 3124.1112 3140.6560 3217.8649 3604.8153
redmass: 2.9109 3.1973 2.1643 1.2539 3.5288 2.8474 3.1523 2.2540 1.2323 1.3518 1.3630 2.5309 2.1561 3.1094 2.7493 3.5399 2.4266 2.5323 2.9257 2.4774 3.1608 3.8185 1.2253 3.0220 3.2565 4.7582 3.9073 3.3676 4.3384 3.2014 1.5233 1.4261 3.3851 4.1615 2.4814 1.4738 1.3439 1.3383 2.7721 3.2106 1.5038 1.6376 1.9624 1.8529 1.5249 1.4771 1.4757 2.3196 1.4252 1.4999 1.6134 1.8779 2.0875 1.5634 1.9706 1.9343 1.8777 1.7792 2.0811 1.3563 1.9911 1.8530 1.2545 2.6315 1.2367 1.2832 2.2214 1.1590 2.5213 1.0490 1.0786 1.0625 2.3594 1.0479 1.0550 1.0823 1.0680 1.0539 1.8054 5.8268 5.5016 7.2451 1.0580 1.0640 1.0616 1.0809 1.0371 1.0352 1.0723 1.0887 1.0730 1.0977 1.0995 1.0984 1.1009 1.1003 1.1000 1.0868 1.0918 1.0971 1.0972 1.0800
irintensity: 0.7781 0.0528 1.4183 0.1372 0.4933 1.5064 1.3969 1.6145 0.0533 0.8571 0.3398 0.8545 0.4614 1.1263 6.8017 1.1704 7.0225 0.5655 3.1883 1.1613 1.2947 3.0871 76.0629 1.0487 9.5874 0.4471 8.1311 3.4195 2.0311 3.5401 21.1948 65.4645 1.0376 11.3692 4.1402 16.9910 1.1994 1.6441 0.4761 7.1463 10.9685 46.9118 14.1035 44.9089 11.4004 1.8502 10.9228 7.5404 2.5484 8.9545 5.3693 14.4834 9.7129 0.5281 11.7863 15.2235 0.2825 10.3393 8.3063 5.7680 29.9825 23.7628 22.0057 13.1463 8.1114 3.0530 16.8203 1.7763 6.2757 13.2414 8.3929 1.2942 43.7712 11.8950 17.3193 16.0055 21.2040 15.4710 21.4024 12.7029 16.7093 1.8939 77.1802 71.8083 211.9011 27.3464 59.9930 31.4245 41.9470 35.4273 37.4367 26.7376 31.7428 20.5478 30.7183 64.2143 24.0753 7.8844 23.3909 25.4147 8.0814 38.4364
temp: 298.150 k
press: 1.00000 atm
elementType: 7 7 6 6 6 6 6 6 6 6 6 6 6 6 6 6 1 1 1 1 1 1 1 1 1 1 1 1 1 1 1 1 1 1 1 1
symmnumber: 1
zpe: 810950.9 jmol-1
zpe.correction: 0.308875 hartree
zpe.thermalcorrener: 0.325679 hartree
zpe.thermalcorrenthalpy: 0.326623 hartree
zpe.thermalcorrgfe: 0.263191 hartree
zpe.sumelectzpe: -653.781144 hartree
zpe.sumelectthermal: -653.764340 hartree
zpe.sumelectthermalent: -653.763395 hartree
zpe.sumelectthermalfe: -653.826828 hartree
dipole: 1.8872 0.7944 0.5865
dipole: 2.1299
quadrupole: -91.0295 -87.4144 -101.8325
quadrupole: -3.1911 2.2470 2.9456
quadrupole: 2.3960 6.0110 -8.4070 -3.1911 2.2470 2.9456
hfenergy: -654.0900187 hartree
pointgroup: C01 [X(C14H20N2)]
dipole: -0.7429674 0.383336 -0.0571953 debye
polarizability: 253.5897443|-5.0292629|147.3561666|-2.849871|21.3728849|112.1548506 unknown
InChI: InChI=1S/C14H20N2/c1-10-5-6-13-12(7-10)8-14(15-13)11(2)9-16(3)4/h5-8,11,15H,9H2,1-4H3
charge 0 multiplicity 1
36 atoms
N  0.327908 1.344758 0.617103
N  -4.35831 -0.312868 -0.262362
C  -2.083481 0.61163 0.345724
C  -0.596638 0.365389 0.200665
C  -2.896032 -0.5526 -0.278918
C  1.534067 -0.425206 -0.174893
C  0.122128 -0.72944 -0.290107
C  1.635095 0.889517 0.401414
C  -2.494107 0.829339 1.828243
C  2.726198 -1.126089 -0.499864
C  2.881061 1.502127 0.653071
C  3.982971 -0.531965 -0.256204
C  -5.133708 -1.565314 -0.370977
C  -4.796563 0.687315 -1.25659
C  4.042751 0.778208 0.319344
C  5.273829 -1.261626 -0.59562
H  -2.330137 1.541025 -0.212821
H  -2.522971 -0.743404 -1.317452
H  -2.696941 -1.466951 0.312475
H  -0.308985 -1.646015 -0.688376
H  0.075825 2.238031 1.034383
H  -3.592644 0.914591 1.890015
H  -2.041708 1.743951 2.255842
H  -2.172466 -0.028806 2.446542
H  2.673371 -2.129289 -0.939887
H  2.952488 2.504006 1.091888
H  -6.211434 -1.344551 -0.265904
H  -4.845639 -2.253941 0.442936
H  -4.9874 -2.099512 -1.344654
H  -4.592663 0.373902 -2.312651
H  -4.289646 1.652525 -1.085186
H  -5.883078 0.858014 -1.153479
H  5.025754 1.229214 0.504109
H  5.072647 -2.257698 -1.027031
H  5.878509 -0.695037 -1.329573
H  5.90525 -1.406431 0.301896
