program: Gaussian 09
title: 000186742
version: EM64L-G09RevD.01
frameworkgroup: C1[X(C12H6Cl4O)]
method: RPBEPBE
basis: SDD
operation: Freq
keyword: #p
keyword: freq=noraman
keyword: PBEPBE/SDD
title: #p freq=noraman PBEPBE/SDD
converged: YES YES NO NO
title: Mulliken charges:
elementType: Cl Cl Cl Cl O C C C C C C C C C C C C H H H H H H
charge: -0.022386 -0.035782 -0.049425 -0.051180 -0.394702 0.295250 0.480491 0.340058 -0.300518 -0.314171 -0.318026 -0.323463 -0.247647 -0.097141 -0.201174 -0.232400 -0.219672 0.275739 0.264940 0.261199 0.262681 0.262578 0.364751
chargesum: 0.00000
title: Mulliken charges with hydrogens summed into heavy atoms:
elementType: Cl Cl Cl Cl O C C C C C C C C C C C C
charge: -0.022386 -0.035782 -0.049425 -0.051180 -0.029951 0.295250 0.480491 0.340058 -0.300518 -0.314171 -0.042287 -0.323463 0.017293 -0.097141 0.060026 0.030281 0.042906
polarizability: 2.29844603e+02 5.35453196e+00 1.54054874e+02 -4.01423537e+00 -1.60648763e+00 1.24580513e+02
1716.lowfreq: -3.7952 -2.6100 0.0019 0.0031 0.0035 5.0422 18.9038 50.6487 58.3152
frequency: 18.8180 50.6472 58.3130 91.4912 92.2668 130.3945 139.6389 207.1154 209.6515 260.0820 282.0029 292.9900 300.9942 307.6856 313.0106 329.5986 404.6309 437.6811 452.0425 464.4545 501.0176 527.7358 560.5280 566.6876 585.7294 612.4274 644.2891 705.1835 726.6267 750.1635 790.6876 813.3052 818.7146 871.4971 890.8458 929.1690 947.9252 999.9460 1055.8608 1082.0187 1114.8443 1128.2710 1137.4488 1214.4125 1238.8226 1242.7180 1266.7860 1356.9970 1371.7488 1379.8185 1422.2723 1434.0363 1472.9275 1559.6138 1568.0393 1592.4597 1605.1770 3164.5028 3169.0151 3171.9741 3183.3139 3189.3266 3493.2673
redmass: 18.4226 10.4463 9.2611 10.5834 9.8993 10.9803 25.3970 6.7592 14.1538 7.5443 6.2271 7.3221 8.7962 20.8755 18.8638 7.5381 4.9851 3.9268 1.1148 4.6218 7.7675 5.8542 7.4607 4.5604 7.0220 5.3766 7.7761 7.2702 4.7562 7.5785 1.3489 1.3724 6.6092 5.9767 1.5633 1.3265 1.3441 8.0804 7.4675 1.8910 2.2326 1.6194 1.3703 1.5087 2.4846 1.6897 1.8045 7.2890 6.7438 3.7145 2.9449 2.9693 4.2553 6.8643 7.3204 8.6363 8.9115 1.0889 1.0893 1.0931 1.0979 1.0975 1.0649
irintensity: 0.0245 0.6007 0.5962 0.6722 0.4378 0.3937 0.0541 0.0804 3.8101 3.0806 4.4807 0.8291 0.3491 0.2652 0.1664 0.7074 5.0728 7.1954 101.0213 6.8524 40.8741 43.9095 4.0402 7.0860 1.3582 10.6147 4.4894 8.9813 4.8236 2.5327 47.9641 30.6967 38.4692 85.4196 0.9901 0.0550 0.0080 102.8385 23.0463 34.7571 59.1433 6.9642 2.2061 127.4679 7.0476 1.6443 31.1386 4.5169 17.5462 20.8346 140.8911 68.2306 14.2902 9.0716 10.2792 8.6894 18.8089 0.4085 0.1075 0.2941 1.6594 0.3889 70.1301
temp: 298.150 k
press: 1.00000 atm
elementType: 17 17 17 17 8 6 6 6 6 6 6 6 6 6 6 6 6 1 1 1 1 1 1
symmnumber: 1
zpe: 375039.2 jmol-1
zpe.correction: 0.142845 hartree
zpe.thermalcorrener: 0.158492 hartree
zpe.thermalcorrenthalpy: 0.159436 hartree
zpe.thermalcorrgfe: 0.097617 hartree
zpe.sumelectzpe: -2375.151941 hartree
zpe.sumelectthermal: -2375.136295 hartree
zpe.sumelectthermalent: -2375.135351 hartree
zpe.sumelectthermalfe: -2375.197169 hartree
dipole: -1.7725 -0.3062 -0.3020
dipole: 1.8240
quadrupole: -116.6642 -119.5449 -128.2170
quadrupole: -8.6914 5.7186 -0.1325
quadrupole: 4.8112 1.9304 -6.7416 -8.6914 5.7186 -0.1325
hfenergy: -2375.2947864 hartree
pointgroup: C01 [X(C12H6Cl4O1)]
dipole: 0.6713693 0.2322984 0.1013138 debye
dipolederiv: -0.3215865 -0.2888186 -0.0629423 -0.2537271 -0.5117944 -0.1360937 -0.0671562 -0.1330286 -0.0803113 -0.3150322 0.0704886 -0.2848779 0.0589905 -0.0613235 0.0859959 -0.270202 0.0880043 -0.5632364 -0.4640432 -0.2678571 -0.0527926 -0.3671269 -0.4872434 -0.1214594 -0.0863289 -0.136109 -0.0811325 -0.4489684 0.07386 -0.3165318 0.0846714 -0.0793911 0.0775403 -0.4192107 0.0928887 -0.5522725 -0.253842 0.3219706 0.1092856 0.1912703 -1.0657724 -0.2656672 0.0810982 -0.274442 -0.4181139 0.184837 -0.2471614 -0.1441717 0.1487578 -0.287445 -0.111269 -0.0052942 -0.0521575 -0.066652 0.2531706 -0.0115181 -0.1590645 -0.0133488 -0.0028933 0.0272892 -0.0922399 -0.0019099 -0.074426 0.0218317 -0.3393377 -0.1040279 -0.3571523 0.8010063 0.2654704 -0.1177905 0.2870076 0.2138808 0.531114 0.5009021 0.1006358 0.2159591 0.7753704 0.2539468 -0.0099794 0.2302714 0.0314057 0.277671 -0.1096946 0.5109032 -0.0904047 -0.0107664 -0.130718 0.3688411 -0.1410269 0.7640869 -0.2580166 0.0254879 -0.0969682 0.0268154 -0.0551167 0.0242493 -0.0828269 0.0217676 -0.1388698 0.450542 0.6949019 0.1911751 0.5010725 0.4641207 0.1628084 0.1199407 0.1407225 -0.0645993 -0.3223403 -0.148093 -0.0264617 -0.139926 -0.2423431 -0.015185 -0.0066205 -0.024469 -0.1432587 0.5536392 -0.1209555 0.5413433 -0.13845 -0.0312995 -0.1264757 0.6406258 -0.1401768 0.7783949 -0.0896407 0.0184195 -0.1218229 0.0240521 -0.0960136 0.0196178 -0.0935418 0.0238016 -0.1122685 -0.0768241 -0.1281439 -0.0429357 0.0734433 0.0506624 0.0293709 0.0314392 0.0581656 -0.0529468 -0.0884603 0.0034462 -0.1222056 0.0030869 -0.1106261 0.0184238 -0.117153 0.0165179 -0.1591426 0.093464 0.0079006 0.0348762 0.0014833 0.1336926 -0.0020667 0.0591967 0.0043619 0.0058416 0.0578489 0.013977 0.0179766 0.0291333 0.0118316 -0.0627553 0.0243806 -0.0600108 0.1449279 0.0597617 0.0111341 0.0273785 0.0145397 0.1565965 0.0082347 0.0442791 0.0062333 -0.0206355 -0.024112 -0.0011347 0.0205185 -0.0073656 0.1053885 -0.0212078 0.0105784 -0.0243922 0.1540717 -0.0353139 0.0284877 0.0093308 0.0252319 0.1613881 0.0023525 -0.0002027 0.0052761 0.0913923 0.2143002 -0.1082615 -0.0286208 -0.0310064 0.3819715 0.0175975 -0.0118332 0.0127039 0.3438638 unknown
polarizability: 225.4849054|6.9712984|138.5627493|17.7870626|16.4734182|144.4323347 unknown
InChI: InChI=1S/C12H6Cl4O/c13-6-1-2-8(14)7(5-6)11-9(15)3-4-10(16)12(11)17/h1-5,17H
charge 0 multiplicity 1
23 atoms
Cl 0.168089 -2.846831 -1.038754
Cl -0.357056 -0.330486 2.83616
Cl 4.034054 2.085733 0.366273
Cl -4.093083 0.558536 -2.310234
O  0.992269 2.001797 0.65074
C  0.670502 -0.247047 -0.135286
C  -0.798169 -0.06793 0.075965
C  1.555575 0.828334 0.167894
C  1.244783 -1.43232 -0.648917
C  -1.389331 -0.063217 1.362013
C  -1.647789 0.123983 -1.043953
C  2.946636 0.669751 -0.043895
C  2.629547 -1.589424 -0.861509
C  -3.027304 0.312188 -0.853318
C  -2.772098 0.125962 1.549836
C  3.494039 -0.517556 -0.550793
C  -3.608787 0.318496 0.428804
H  -1.220714 0.126558 -2.050379
H  3.026288 -2.528105 -1.25454
H  -3.19486 0.120316 2.558067
H  4.572704 -0.610751 -0.702334
H  -4.684382 0.466857 0.557082
H  1.702187 2.668854 0.852178
