program: Gaussian 09
title: 000186715
version: EM64L-G09RevD.01
frameworkgroup: C1[X(C12H12BrN3O2)]
method: RPBEPBE
basis: SDD
operation: Freq
keyword: #p
keyword: freq=noraman
keyword: PBEPBE/SDD
title: #p freq=noraman PBEPBE/SDD
converged: YES YES NO NO
title: Mulliken charges:
elementType: Br O O N N N C C C C C C C C C C C C H H H H H H H H H H H H
charge: -0.000328 -0.257363 -0.259085 -0.120350 -0.120256 -0.376972 -0.358991 -0.359003 -0.404164 -0.404458 0.258364 0.255177 0.447388 -0.277765 -0.359336 -0.206661 -0.217491 -0.226401 0.230208 0.260305 0.230419 0.259304 0.228927 0.217487 0.228782 0.217123 0.321860 0.305427 0.234881 0.252970
chargesum: 0.00000
title: Mulliken charges with hydrogens summed into heavy atoms:
elementType: Br O O N N N C C C C C C C C C C C C
charge: -0.000328 -0.257363 -0.259085 -0.120350 -0.120256 -0.376972 0.131523 0.130721 0.042251 0.041446 0.258364 0.255177 0.447388 0.044096 -0.053909 -0.206661 0.017389 0.026569
polarizability: 2.54344145e+02 3.37909636e+00 1.81561843e+02 1.40743869e+00 -1.62075018e+00 8.31550814e+01
1716.lowfreq: -10.9229 -0.0008 -0.0008 -0.0007 2.0726 6.4955 8.1793 41.2868 81.4238
frequency: -2.9997 41.2293 81.4108 102.2446 108.8819 144.2864 162.3727 183.4888 217.8179 256.7698 284.4117 287.9838 303.3801 317.2765 345.1594 364.1857 382.3051 437.6531 463.1039 480.4689 563.2001 582.8825 620.7406 639.6692 652.3382 674.1682 684.4303 710.7028 732.6072 790.9878 813.6559 826.0754 873.0320 890.6928 909.8490 912.4549 918.1414 965.3099 978.9105 987.0117 1039.4274 1047.8675 1079.8969 1084.4765 1090.9165 1108.2934 1120.0969 1149.4494 1170.1658 1189.6977 1242.6662 1255.9384 1278.2067 1293.0898 1310.8275 1334.4376 1342.2424 1347.2725 1353.6139 1364.5152 1367.1437 1371.9929 1425.3800 1459.5822 1461.8593 1472.4069 1473.0970 1477.7667 1566.4998 1604.4499 1641.4986 1694.4557 2963.7915 2965.0969 3001.4745 3003.1120 3067.9061 3075.1010 3093.2515 3094.0572 3146.4176 3176.6229 3194.1354 3198.4302
redmass: 6.6538 4.8848 8.3380 5.1840 3.4644 7.7105 5.9928 5.9188 2.3472 6.4746 4.0496 4.1319 5.9676 6.6807 7.5430 2.6143 5.9484 3.2322 2.4339 5.0606 5.2315 3.0201 10.0376 6.1933 11.4998 6.5380 2.5298 7.0424 5.4265 1.3920 4.9262 1.4982 2.7634 3.0758 1.3603 1.4647 1.4549 2.2595 4.8812 1.4032 5.8967 6.3846 1.8615 1.6161 3.1861 1.6288 2.0637 2.5090 1.4016 1.0950 1.6694 1.3426 1.8341 1.8795 2.1724 1.3112 3.4203 1.6041 1.4109 1.4586 4.4709 7.3633 2.9022 1.0875 1.0919 2.3858 1.1077 1.0881 6.7567 6.2990 10.9498 11.8317 1.0696 1.0693 1.0646 1.0601 1.0991 1.1016 1.0944 1.0959 1.0887 1.0956 1.0928 1.0954
irintensity: 0.0970 4.0914 0.9898 1.1226 1.6731 1.4885 0.7088 1.4780 3.1694 1.3420 7.5964 8.4945 2.5794 3.8739 40.0139 18.3433 1.7895 7.8540 5.7648 3.5682 0.7435 8.0590 13.2282 0.8622 17.8600 52.2183 32.5621 3.7864 6.7620 58.8279 8.0560 1.5645 23.3439 11.4199 10.7431 1.8998 17.3942 12.3827 14.0099 2.9734 17.3891 57.4959 6.1021 0.8122 11.1540 11.3411 18.5357 2.8125 0.6898 2.8918 123.5756 4.8699 109.8682 61.3443 131.0533 3.0310 381.1034 82.3159 1.9371 7.1455 3.7937 11.6761 59.7834 11.9318 13.5380 211.3627 25.1000 0.4548 36.0600 110.6550 542.9961 125.7445 51.5785 32.1020 24.5775 33.7649 36.9666 37.5940 0.2402 16.6001 9.3634 4.9737 15.1177 13.1536
temp: 298.150 k
press: 1.00000 atm
elementType: 35 8 8 7 7 7 6 6 6 6 6 6 6 6 6 6 6 6 1 1 1 1 1 1 1 1 1 1 1 1
symmnumber: 1
zpe: 597474.4 jmol-1
zpe.correction: 0.227566 hartree
zpe.thermalcorrener: 0.242098 hartree
zpe.thermalcorrenthalpy: 0.243042 hartree
zpe.thermalcorrgfe: 0.185169 hartree
zpe.sumelectzpe: -791.351309 hartree
zpe.sumelectthermal: -791.336778 hartree
zpe.sumelectthermalent: -791.335833 hartree
zpe.sumelectthermalfe: -791.393706 hartree
dipole: 6.4665 -0.0460 -0.0296
dipole: 6.4667
quadrupole: -85.4979 -118.6588 -115.3630
quadrupole: -14.7481 0.9470 -1.8499
quadrupole: 21.0087 -12.1522 -8.8565 -14.7481 0.9470 -1.8499
hfenergy: -791.5788753 hartree
pointgroup: C01 [X(C12H12Br1N3O2)]
dipole: 2.5046363 -0.4441479 0.0494537 debye
polarizability: 250.7259016|-16.2116808|184.7586756|0.1329543|-6.8014002|83.5764928 unknown
InChI: InChI=1S/C12H12BrN3O2/c13-9-4-3-5-10(8-9)16-11(17)14-6-1-2-7-15(14)12(16)18/h3-5,8H,1-2,6-7H2
charge 0 multiplicity 1
30 atoms
Br -4.837963 2.239628 -0.32031
O  0.199071 2.265122 0.177581
O  0.679797 -2.486692 -0.086392
N  2.009979 0.766513 -0.052459
N  2.158421 -0.64972 0.047049
N  -0.040783 -0.159726 0.05963
C  3.137081 1.607906 0.385647
C  3.403337 -1.247292 -0.467382
C  4.442037 1.066415 -0.236933
C  4.608991 -0.444345 0.067759
C  0.659102 1.099016 0.069004
C  0.897938 -1.250568 0.002419
C  -1.471991 -0.307622 0.099039
C  -2.302381 0.830582 -0.093867
C  -2.054839 -1.582783 0.326517
C  -3.696803 0.659255 -0.053525
C  -3.458475 -1.708035 0.356386
C  -4.304631 -0.591687 0.167985
H  3.205808 1.598149 1.493762
H  2.91184 2.636518 0.061881
H  3.395586 -1.236319 -1.577569
H  3.4156 -2.296706 -0.132379
H  5.295577 1.637992 0.168777
H  4.421286 1.227607 -1.331798
H  5.531439 -0.832349 -0.399615
H  4.697699 -0.598132 1.160389
H  -1.860321 1.815632 -0.248239
H  -1.418156 -2.458749 0.456708
H  -3.902763 -2.693804 0.529651
H  -5.392685 -0.694504 0.193583
