program: Gaussian 09
title: 000186700
version: EM64L-G09RevD.01
frameworkgroup: C1[X(C11H14N2O2)]
method: RPBEPBE
basis: SDD
operation: Freq
keyword: #p
keyword: freq=noraman
keyword: PBEPBE/SDD
title: #p freq=noraman PBEPBE/SDD
converged: YES YES NO NO
title: Mulliken charges:
elementType: O O N N C C C C C C C C C C C H H H H H H H H H H H H H H
charge: -0.417975 -0.233579 -0.188663 -0.001954 -0.156016 -0.480608 -0.455363 -0.352661 0.458407 -0.453302 -0.325709 -0.524749 0.201747 -0.199522 -0.339335 0.210142 0.232351 0.238053 0.231703 0.217285 0.232266 0.196807 0.266432 0.244299 0.303565 0.246318 0.231536 0.239961 0.378566
chargesum: 0.00000
title: Mulliken charges with hydrogens summed into heavy atoms:
elementType: O O N N C C C C C C C C C C C
charge: -0.039410 -0.233579 -0.188663 -0.001954 0.054125 -0.010204 -0.006376 0.076412 0.458407 0.057429 -0.022144 -0.278431 0.201747 0.032014 -0.099375
polarizability: 1.49659632e+02 -1.19818983e+01 1.31453699e+02 -3.34138950e+00 -1.26237921e+01 1.10982055e+02
1716.lowfreq: -10.9657 -7.5808 -1.5442 0.0007 0.0008 0.0009 29.6667 39.5997 50.8854
frequency: 29.6338 39.4240 50.8720 57.2124 82.8064 105.9891 148.8506 215.6179 236.8569 272.6045 290.2490 349.7572 384.1117 404.6705 481.8060 526.8064 556.0479 574.0281 604.4428 635.7662 643.0771 667.6677 728.6428 777.4144 818.9267 829.1395 853.1184 870.0268 901.1027 918.7993 926.3646 935.8839 954.3743 983.4899 1003.5814 1009.3044 1027.1394 1033.4980 1047.1121 1101.8682 1113.1419 1131.5511 1163.7067 1185.4124 1194.9312 1216.6913 1225.7473 1248.6004 1262.6467 1273.7381 1283.3209 1293.4962 1310.0720 1317.3129 1318.8560 1349.5514 1362.9981 1370.1122 1416.7138 1426.4328 1456.6536 1463.5156 1477.1342 1508.8802 1558.0669 1582.8862 1672.7883 2841.5442 2895.1058 2924.4618 2976.8960 3010.0994 3014.1151 3025.5344 3075.6391 3089.9780 3102.9445 3126.9500 3136.6823 3161.0151 3515.7855
redmass: 6.3208 6.4930 5.6361 3.2789 4.0608 2.9849 2.8162 2.2854 3.5402 3.8973 5.3554 4.9660 2.7468 3.3509 2.1178 4.2229 2.3484 3.3213 7.4779 1.3789 4.0847 5.6878 2.0147 3.2453 1.7654 3.7196 1.8453 3.1441 1.6122 2.1464 1.6356 1.9249 1.4774 2.0824 2.9905 1.5026 2.9297 2.6506 1.9660 1.8885 2.0809 1.5509 1.6016 1.3767 1.4328 1.2845 1.9372 1.5374 2.0067 1.5144 1.6174 1.6536 1.7342 2.1315 1.7128 1.3142 1.6224 1.5101 1.8640 1.1622 2.1098 1.1013 1.0949 1.0868 5.5281 5.8261 8.4950 1.0818 1.0692 1.0644 1.0977 1.0623 1.0634 1.0877 1.1009 1.1051 1.0907 1.0877 1.0925 1.0997 1.0642
irintensity: 0.3799 3.0129 2.3092 0.7704 2.5783 0.2491 1.9173 0.1153 1.0066 8.0164 2.0074 7.3029 1.7405 3.9111 25.1844 18.5583 4.8890 21.8565 4.0616 128.4384 0.7060 12.8002 37.7386 21.2048 27.4964 5.0131 0.7245 3.4351 4.5969 3.2897 4.8636 4.5642 1.7839 11.7480 6.2093 30.7238 22.0888 294.4978 2.7500 4.4381 23.2950 18.0899 16.9234 12.8179 1.5776 2.9437 8.1813 5.2691 44.1086 47.1130 5.4380 3.2659 1.6959 6.2699 16.5131 1.5648 13.4586 4.4684 33.7635 17.4852 18.8611 11.3024 6.7133 2.7995 11.3475 0.4768 181.4481 74.2970 71.5283 106.6957 33.1941 53.2727 18.8954 5.3488 27.5015 37.9427 28.6542 7.6923 6.7101 27.5864 24.5930
temp: 298.150 k
press: 1.00000 atm
elementType: 8 8 7 7 6 6 6 6 6 6 6 6 6 6 6 1 1 1 1 1 1 1 1 1 1 1 1 1 1
symmnumber: 1
zpe: 617032.6 jmol-1
zpe.correction: 0.235015 hartree
zpe.thermalcorrener: 0.248888 hartree
zpe.thermalcorrenthalpy: 0.249833 hartree
zpe.thermalcorrgfe: 0.192082 hartree
zpe.sumelectzpe: -686.386145 hartree
zpe.sumelectthermal: -686.372272 hartree
zpe.sumelectthermalent: -686.371328 hartree
zpe.sumelectthermalfe: -686.429078 hartree
dipole: -2.9098 0.7597 -0.0440
dipole: 3.0077
quadrupole: -96.6690 -77.5789 -91.2314
quadrupole: -0.6635 7.0702 -2.5750
quadrupole: -8.1759 10.9142 -2.7383 -0.6635 7.0702 -2.5750
hfenergy: -686.6211601 hartree
pointgroup: C01 [X(C11H14N2O2)]
dipole: 1.1237761 0.3685344 0.0395197 debye
polarizability: 147.4618389|15.0237431|125.6057597|-2.694045|15.2957886|119.0277873 unknown
InChI: InChI=1S/C11H14N2O2/c14-11(15)8-13-6-2-4-10(13)9-3-1-5-12-7-9/h1,3,5,7,10,14H,2,4,6,8H2
charge 0 multiplicity 1
29 atoms
O  3.119603 -2.446446 -0.055674
O  2.140524 -1.168346 -1.732036
N  1.18943 0.676307 0.294629
N  -3.47985 -0.790535 0.803884
C  -0.131679 1.091847 0.806729
C  -0.246782 2.543344 0.253393
C  1.208545 3.068824 0.323853
C  2.064507 1.823606 -0.033189
C  -1.268049 0.184444 0.345293
C  1.77664 -0.584754 0.674097
C  -1.250813 -0.435856 -0.930137
C  -2.399663 -0.037195 1.169148
C  2.330215 -1.379759 -0.517347
C  -2.355269 -1.220434 -1.325246
C  -3.445603 -1.366276 -0.43462
H  -0.159087 1.134986 1.925563
H  -0.961082 3.150639 0.834539
H  -0.597353 2.502465 -0.793832
H  1.387773 3.914775 -0.361061
H  1.438469 3.407664 1.350916
H  2.348567 1.813307 -1.105075
H  3.006062 1.795433 0.559815
H  1.01491 -1.231364 1.1513
H  2.609545 -0.49163 1.410781
H  -0.371835 -0.309821 -1.573309
H  -2.449405 0.406273 2.172735
H  -2.374661 -1.715924 -2.3014
H  -4.321167 -1.967065 -0.706867
H  3.447611 -2.975209 -0.832781
