program: Gaussian 09
title: 000186692
version: EM64L-G09RevD.01
frameworkgroup: C1[X(C12H5ClF2OS)]
method: RPBEPBE
basis: SDD
operation: Freq
keyword: #p
keyword: freq=noraman
keyword: PBEPBE/SDD
title: #p freq=noraman PBEPBE/SDD
converged: NO NO NO NO
title: Mulliken charges:
elementType: Cl S F F O C C C C C C C C C C C C H H H H H
charge: -0.001715 0.257292 -0.196178 -0.199120 -0.275261 0.616014 -0.222159 -0.247859 0.481579 -0.276431 -0.481687 -0.447510 -0.328826 -0.417895 0.378242 0.346405 -0.366822 0.277048 0.274195 0.274476 0.289456 0.266753
chargesum: 0.00000
title: Mulliken charges with hydrogens summed into heavy atoms:
elementType: Cl S F F O C C C C C C C C C C C C
charge: -0.001715 0.257292 -0.196178 -0.199120 -0.275261 0.616014 -0.222159 -0.247859 0.481579 -0.276431 -0.204639 -0.173314 -0.054349 -0.128438 0.378242 0.346405 -0.100069
polarizability: 2.52981121e+02 -7.33880967e+00 1.77144734e+02 -5.03146810e-03 -3.23360987e-02 5.71143330e+01
1716.lowfreq: -26.2526 -0.0015 -0.0007 0.0030 4.9865 8.4216 9.8786 65.8361 124.9651
frequency: -26.2418 65.8108 124.9611 143.1273 158.2143 170.4616 191.6787 199.6996 258.3684 294.1088 352.0212 357.3042 366.3786 401.6583 429.1162 442.9119 447.0812 471.9414 499.4893 500.1222 551.4464 567.7955 594.5722 665.1711 687.2878 694.3544 714.8973 771.2931 806.1122 809.9213 837.6547 851.9672 855.1532 878.6296 909.6207 936.7548 1036.2248 1048.6553 1122.8631 1156.5321 1164.2096 1191.8962 1216.2739 1251.8333 1263.2252 1361.3559 1381.1758 1385.0788 1400.2519 1439.7837 1474.0307 1580.1874 1589.1900 1602.0299 1615.3721 3164.9687 3169.7006 3170.3994 3190.4732 3193.0210
redmass: 15.7892 7.7708 14.8419 10.7191 11.1278 7.4248 5.1852 15.6491 14.2770 13.2824 7.2954 8.7137 13.6577 9.3829 10.7993 3.1883 10.4832 8.5026 5.0959 7.8412 4.2316 4.0669 6.5346 7.8511 3.8925 5.0007 7.7362 11.4591 7.4743 1.3764 1.3602 1.5294 1.4994 7.8527 9.4073 1.3342 2.9643 2.9002 1.2740 1.9093 2.3260 1.4776 8.7550 1.4042 8.8952 6.9163 5.7901 6.1338 4.6452 3.9639 3.1235 8.9561 7.2307 8.4037 7.9342 1.0928 1.0931 1.0893 1.0977 1.0937
irintensity: 0.0621 0.1533 0.1518 1.7961 1.2789 0.2929 0.3551 0.3343 0.6037 0.3453 0.0005 0.8939 0.2761 4.1721 2.4720 6.6019 4.3633 3.6655 0.1582 4.5547 5.3259 1.6545 3.8933 4.6021 0.0909 15.7942 0.7801 66.8968 117.8584 38.9735 0.5552 94.1236 11.1465 2.9522 34.9946 0.3956 8.1484 6.3909 14.8892 8.5853 228.2512 2.6492 14.9577 12.2679 70.9624 22.2345 22.2403 12.9154 22.2466 415.5398 170.0348 40.9064 134.5280 27.0677 11.1138 0.3215 0.4756 1.1439 0.3469 2.9026
temp: 298.150 k
press: 1.00000 atm
elementType: 17 16 9 9 8 6 6 6 6 6 6 6 6 6 6 6 6 1 1 1 1 1
symmnumber: 1
zpe: 353950.0 jmol-1
zpe.correction: 0.134812 hartree
zpe.thermalcorrener: 0.147774 hartree
zpe.thermalcorrenthalpy: 0.148718 hartree
zpe.thermalcorrgfe: 0.095149 hartree
zpe.sumelectzpe: -1592.116233 hartree
zpe.sumelectthermal: -1592.103271 hartree
zpe.sumelectthermalent: -1592.102327 hartree
zpe.sumelectthermalfe: -1592.155896 hartree
dipole: -0.3449 0.0749 -0.0008
dipole: 0.3529
quadrupole: -118.9617 -104.6846 -113.0905
quadrupole: -1.8651 -0.0021 -0.0106
quadrupole: -6.7161 7.5610 -0.8449 -1.8651 -0.0021 -0.0106
hfenergy: -1592.2510454 hartree
pointgroup: C01 [X(C12H5Cl1F2O1S1)]
dipole: 0.1375803 -0.0187944 -0.0003233 debye
dipolederiv: -0.0669459 -0.0017076 -0.0000401 -0.0949725 -0.6841747 0.0000221 -0.0000173 -0.000059 -0.026374 -0.6213953 0.007859 0.0000156 0.0168489 -0.0784073 0.0000659 -0.0000687 -0.0004174 0.0366583 -1.1098555 0.3659857 -0.0007835 0.4363912 -0.3998011 0.0003676 -0.0010457 0.0003947 -0.143233 -1.2145592 -0.2449026 0.0008395 -0.351119 -0.2872666 0.0002804 0.0011238 0.0002468 -0.1442599 -1.9692763 0.0344311 -0.0000109 0.1105009 -0.2041082 0.0001541 -0.0001021 0.0006947 -0.1542205 1.0244248 -0.3407052 0.0004079 -0.9492166 -0.2886367 -0.0003437 0.00057 -0.0006124 0.1339721 0.6552017 0.1704714 0.0009975 0.689581 0.1611425 0.0002281 0.0004864 0.0003011 -0.063618 0.5284771 -0.2421682 -0.0009459 -0.7363572 0.1332508 0.0003397 -0.0003955 0.0004172 -0.0713496 1.2062296 0.3020382 -0.0004872 0.7226622 -0.0648641 -0.0002584 -0.0005637 -0.0006191 0.103229 0.1084427 0.1331207 0.0003897 0.1038336 1.1021445 -0.0001432 0.0002454 0.0001297 -0.0845815 -0.5035316 0.0633083 -0.0001735 -0.1720515 -0.0634723 -0.0001241 -0.0002716 0.0001293 -0.1338536 -0.4433049 -0.0187808 0.0001332 0.2325684 -0.025085 -0.0001444 0.0002632 0.0001049 -0.11908 -0.0857252 -0.1415009 -0.0003158 0.1161037 0.0723442 -0.0001172 -0.0001206 0.0001285 -0.1401447 -0.2738344 -0.0186404 -0.0001225 0.1370044 -0.3402111 0.0002463 -0.0000204 -0.0000003 -0.1216489 1.2367714 -0.3573013 0.0009628 -0.3914249 0.5154088 -0.0004336 0.0013952 -0.0003694 0.0918953 1.3096341 0.2716776 -0.0010218 0.3255096 0.3290373 -0.0003415 -0.0014631 -0.0002459 0.0840774 -0.1796 0.0420117 0.0000173 -0.1809449 -0.0496687 0.0002542 -0.0001305 0.0000016 -0.1661434 0.1205728 -0.0305298 -0.0001147 0.0053179 0.013136 0.0000444 -0.0001212 -0.000047 0.1841864 0.1193996 0.0169917 0.0001182 -0.0225712 0.006155 0.0000297 0.0001173 -0.0000597 0.1813823 0.0903361 -0.0400033 0.0000984 -0.0255878 0.0033547 -0.000009 0.0000624 -0.0000243 0.1733509 0.0581091 -0.0295339 -0.0001351 -0.0359413 0.0885617 -0.0000402 -0.0001424 -0.0000275 0.1924182 0.0104293 0.0578786 0.0001708 0.0638651 0.06116 -0.0000772 0.0001993 -0.0000664 0.1873374 unknown
polarizability: 253.6608633|-1.3589883|176.4649912|0.0024968|0.0326298|57.114333 unknown
InChI: InChI=1S/C12H5ClF2OS/c13-8-3-7(15)5-11-12(8)16-9-2-1-6(14)4-10(9)17-11/h1-5H
charge 0 multiplicity 1
22 atoms
Cl -2.237014 -3.04541 0.000111
S  0.245163 2.028278 0.003737
F  -4.892338 1.40831 -0.002603
F  5.281092 0.795369 -0.00265
O  0.057285 -1.225405 0.002911
C  -1.137085 -0.482415 0.001415
C  -1.224602 0.931704 0.001334
C  1.581047 0.773233 0.001351
C  1.338763 -0.619866 0.0014
C  -2.332759 -1.241389 0.000097
C  -2.48413 1.568568 -0.000096
C  2.911411 1.245492 -0.000101
C  2.410797 -1.53475 0.000105
C  -3.599618 -0.629541 -0.001189
C  -3.639914 0.772676 -0.00127
C  3.960634 0.311675 -0.001294
C  3.74371 -1.076311 -0.001196
H  -2.571458 2.658846 -0.000255
H  3.136474 2.316327 -0.000264
H  2.177226 -2.602686 0.000172
H  -4.518479 -1.219829 -0.002157
H  4.588495 -1.769476 -0.002156
