program: Gaussian 09
title: 000186686
version: EM64L-G09RevD.01
frameworkgroup: C1[X(C14H13Cl)]
method: RPBEPBE
basis: SDD
operation: Freq
keyword: #p
keyword: freq=noraman
keyword: PBEPBE/SDD
title: #p freq=noraman PBEPBE/SDD
converged: YES YES NO NO
title: Mulliken charges:
elementType: Cl C C C C C C C C C C C C C C H H H H H H H H H H H H H
charge: -0.078857 -0.705422 0.431264 0.361597 0.471481 -0.444672 -0.299409 -0.814896 -0.436439 -0.380211 -0.232435 -0.259254 -0.221782 -0.220579 -0.248303 0.217028 0.237543 0.241415 0.248050 0.259975 0.227490 0.230568 0.245610 0.233426 0.256476 0.226083 0.225608 0.228645
chargesum: 0.00000
title: Mulliken charges with hydrogens summed into heavy atoms:
elementType: Cl C C C C C C C C C C C C C C
charge: -0.078857 -0.250851 0.431264 0.361597 0.471481 -0.203257 -0.299409 -0.079381 -0.205871 -0.134601 0.000991 -0.002778 0.004300 0.005029 -0.019657
polarizability: 1.89665759e+02 1.53858845e+01 1.45831416e+02 1.10821296e+01 7.82993744e+00 1.21264524e+02
1716.lowfreq: -6.7177 -0.0032 -0.0023 -0.0012 5.4388 6.1429 29.1287 31.4001 51.9103
frequency: 29.1100 30.9118 51.8985 82.7535 115.0763 180.9605 211.0462 250.2179 264.9025 286.4146 321.5481 372.0988 404.4557 436.9712 471.3724 501.1285 512.8876 528.6497 596.5785 617.0216 639.8059 704.2219 719.9438 743.1830 773.5884 786.5407 814.1043 846.5514 855.9041 897.4919 910.5290 947.9823 972.5478 978.9894 990.1094 996.7182 1008.0782 1026.8749 1039.3135 1073.3824 1083.6422 1128.2068 1171.3557 1176.6306 1181.7302 1188.8604 1205.4910 1213.4704 1253.0060 1290.3797 1334.8801 1365.1367 1381.7229 1402.0711 1426.9813 1439.8805 1452.1252 1463.1489 1475.7995 1477.6615 1484.2371 1568.5770 1592.5802 1606.7339 1613.4911 2975.7376 2981.3894 3024.8801 3058.5967 3112.3207 3116.0519 3122.7565 3125.4881 3134.7897 3145.1190 3150.8671 3162.6158 3174.9993
redmass: 3.7562 3.7106 4.5814 1.1485 4.4498 5.1062 4.1965 4.1437 4.1782 4.5236 2.2973 7.5964 2.8236 2.7557 3.3798 3.6630 3.7872 5.5881 5.5321 6.1560 4.9782 2.0928 2.3995 1.7766 1.6375 4.5032 2.8301 3.7179 1.2479 1.4343 1.4412 1.7703 1.3490 1.3860 6.0418 1.3225 1.7137 2.2415 1.5130 2.0465 1.6552 2.1481 1.0842 1.4965 1.2902 1.1212 2.1865 2.1716 1.5880 1.6622 1.3178 5.9291 7.3743 1.2539 2.0463 2.1670 2.0806 1.4248 1.1784 1.0885 1.9055 6.4367 6.0820 6.8191 6.1428 1.0599 1.0413 1.0999 1.0945 1.0874 1.0967 1.0859 1.0881 1.0911 1.0959 1.0922 1.1015 1.0980
irintensity: 0.0984 0.0297 0.0461 0.3339 0.5547 0.8066 0.0732 4.1198 2.2991 4.2492 0.7632 7.1957 0.0743 1.9468 5.2654 2.6758 0.5280 0.7870 4.7231 0.3612 26.4576 37.7921 30.5622 30.4688 49.1807 14.5771 12.6730 10.4953 0.2344 3.3714 0.2726 7.1117 0.5988 0.1406 0.9053 0.4266 57.7350 10.0347 6.1740 5.4473 14.7709 8.8719 0.4778 3.8197 3.4085 1.4476 3.9010 0.3653 0.1398 0.7743 0.7140 1.2878 0.4391 17.4349 13.7549 7.8391 13.9886 19.5194 33.5796 16.5144 10.8097 27.1800 1.2557 10.7172 6.2372 28.1737 16.2127 12.7341 10.3029 9.4924 6.0816 1.4446 8.8128 12.0621 38.3827 14.3461 25.8020 9.5067
temp: 298.150 k
press: 1.00000 atm
elementType: 17 6 6 6 6 6 6 6 6 6 6 6 6 6 6 1 1 1 1 1 1 1 1 1 1 1 1 1
symmnumber: 1
zpe: 587697.1 jmol-1
zpe.correction: 0.223842 hartree
zpe.thermalcorrener: 0.237299 hartree
zpe.thermalcorrenthalpy: 0.238243 hartree
zpe.thermalcorrgfe: 0.181722 hartree
zpe.sumelectzpe: -1000.299200 hartree
zpe.sumelectthermal: -1000.285744 hartree
zpe.sumelectthermalent: -1000.284799 hartree
zpe.sumelectthermalfe: -1000.341320 hartree
dipole: -1.5951 1.2931 -0.6329
dipole: 2.1488
quadrupole: -95.8630 -91.9233 -91.3437
quadrupole: 8.3144 1.1581 3.1629
quadrupole: -2.8197 1.1201 1.6996 8.3144 1.1581 3.1629
hfenergy: -1000.5230423 hartree
pointgroup: C01 [X(C14H13Cl1)]
dipole: 0.5865814 -0.5584962 -0.2422416 debye
polarizability: 189.3280702|11.514412|143.0719913|-16.6172933|-9.7138737|124.3616368 unknown
InChI: InChI=1S/C14H13Cl/c1-11-13(8-5-9-14(11)15)10-12-6-3-2-4-7-12/h2-9H,10H2,1H3
charge 0 multiplicity 1
28 atoms
Cl -3.700594 2.178297 0.582528
C  0.430385 -0.741824 -1.297423
C  -0.900747 -0.648808 -0.558553
C  -1.552124 0.6167 -0.385815
C  1.642514 -0.195236 -0.532097
C  -1.491212 -1.827967 -0.044206
C  -2.781642 0.608119 0.315061
C  -0.936505 1.881162 -0.95038
C  2.670912 0.49504 -1.222421
C  1.785781 -0.405906 0.863399
C  -2.719843 -1.790589 0.650734
C  -3.377841 -0.557509 0.836594
C  3.818781 0.958675 -0.540381
C  2.93092 0.057924 1.549009
C  3.953288 0.741044 0.85011
H  0.366187 -0.217665 -2.270825
H  0.619027 -1.807552 -1.535091
H  -0.980711 -2.786639 -0.193637
H  -1.524637 2.772406 -0.685693
H  0.093472 2.018512 -0.575695
H  -0.875429 1.831148 -2.054745
H  2.571892 0.671305 -2.30129
H  0.993057 -0.925579 1.41396
H  -3.165942 -2.7101 1.043567
H  -4.331239 -0.497024 1.368698
H  4.602567 1.491343 -1.09102
H  3.02465 -0.111372 2.627878
H  4.840233 1.102394 1.382436
