program: Gaussian 09
title: 000186688
version: EM64L-G09RevD.01
frameworkgroup: C1[X(C8H18NO3PS2)]
method: RPBEPBE
basis: SDD
operation: Freq
keyword: #p
keyword: freq=noraman
keyword: PBEPBE/SDD
title: #p freq=noraman PBEPBE/SDD
converged: YES YES NO NO
title: Mulliken charges:
elementType: S S P O O O N C C C C C C C C H H H H H H H H H H H H H H H H H H
charge: 0.224433 0.230769 1.415401 -0.485575 -0.548542 -0.588055 -0.649825 -0.410743 -0.654958 -0.638867 -0.607873 -0.248900 -0.247948 -0.650195 -0.644384 0.276262 0.349230 0.275827 0.265207 0.357989 0.243921 0.208407 0.233812 0.224405 0.226672 0.224822 0.238375 0.209646 0.231530 0.247101 0.215633 0.255386 0.221034
chargesum: 0.00000
title: Mulliken charges with hydrogens summed into heavy atoms:
elementType: S S P O O O N C C C C C C C C
charge: 0.224433 0.230769 1.415401 -0.485575 -0.548542 -0.588055 -0.291836 -0.134481 -0.305728 -0.097833 0.078268 0.202177 0.215249 0.038083 0.047669
polarizability: 1.97875701e+02 -1.54302969e-01 1.65420527e+02 2.73865151e+00 4.07416579e+00 1.27570088e+02
1716.lowfreq: -19.8834 -17.8077 -14.8037 -0.0022 -0.0019 -0.0016 4.8359 7.8009 13.2630
frequency: -18.1278 -9.2246 8.5950 27.8363 38.5782 55.1276 86.9511 117.4285 131.5190 162.7782 173.5418 187.0178 192.6202 231.4785 232.4319 247.5656 286.5005 298.9855 315.5895 333.0564 344.4300 376.8995 384.9726 401.8142 419.3229 471.1436 516.6247 544.4812 574.7817 584.9974 653.8627 668.2765 677.9390 710.1998 795.9654 807.2205 811.6084 854.3941 861.5183 867.3770 905.3154 1001.7325 1008.1376 1012.8258 1047.1525 1054.3862 1087.4809 1092.0065 1093.9761 1099.3140 1127.4368 1143.2595 1144.9906 1170.1905 1209.1482 1252.8507 1268.2660 1269.1777 1276.8889 1309.2394 1348.9930 1352.1633 1386.9349 1389.8480 1390.4692 1408.5908 1431.5677 1458.9596 1461.4349 1463.5900 1463.6627 1471.3532 1472.6853 1480.3751 1488.1005 2977.9169 2986.4155 2988.1766 2993.3557 3016.3911 3016.8095 3030.8063 3072.2982 3075.0215 3082.1411 3082.4823 3084.7885 3097.7096 3103.7226 3109.6820 3110.7399 3122.5535 3530.4183
redmass: 4.4136 3.4101 3.7717 3.4672 3.6866 3.2367 3.3355 4.4967 3.3523 3.2605 4.9344 2.6571 3.8833 1.0768 1.3136 1.4848 3.9097 4.1312 3.4908 3.1030 2.8756 4.3377 6.4972 6.4558 3.8316 4.6413 4.6858 1.8515 5.8881 4.9817 6.2499 5.1247 3.7564 5.9435 1.1442 2.0157 1.6490 2.1323 3.5146 3.8153 1.8118 1.4085 2.8275 3.0035 1.4476 13.4118 1.3049 2.2685 2.2377 4.2187 1.1906 1.5378 1.5479 1.7019 1.3849 1.2436 1.1238 1.1277 1.1218 1.3806 1.2171 1.2154 1.2112 1.2330 1.2276 1.1846 1.0869 1.0416 1.0496 1.0570 1.0519 1.0763 1.0477 1.0560 1.0545 1.0383 1.0360 1.0397 1.0595 1.0604 1.0669 1.0748 1.1021 1.0960 1.1039 1.0974 1.0969 1.1075 1.1011 1.1053 1.1026 1.0866 1.0755
irintensity: 0.8453 0.1559 2.4382 0.3350 1.7135 0.6815 0.3374 0.1155 1.3143 1.3426 1.0095 13.1653 4.9383 0.0815 1.0065 6.7331 17.5061 14.7155 2.3363 2.2749 4.6098 2.8277 20.3693 47.2264 15.6999 33.2837 6.8442 33.5691 45.5543 11.6159 84.4005 75.1711 19.6865 70.2863 11.1095 85.0402 40.4067 1.1338 98.9272 182.4780 12.7681 17.4378 180.7768 95.1882 0.9946 105.7445 7.9757 63.0016 14.3445 304.2681 17.4011 5.0023 10.4423 3.9898 15.7313 12.5773 1.3799 9.7103 22.9135 12.5434 9.7475 8.2121 25.1932 28.6959 25.6045 88.1291 10.5863 8.8164 8.3999 12.3986 9.9097 1.5987 7.9092 18.5674 10.2652 37.3858 15.2752 21.2081 28.6513 34.1122 6.1930 29.6458 7.8125 24.1678 0.8356 43.4433 29.9756 7.8454 14.4977 29.4233 31.1946 4.9288 30.8901
temp: 298.150 k
press: 1.00000 atm
elementType: 16 16 15 8 8 8 7 6 6 6 6 6 6 6 6 1 1 1 1 1 1 1 1 1 1 1 1 1 1 1 1 1 1
symmnumber: 1
zpe: 687729.3 jmol-1
zpe.correction: 0.261942 hartree
zpe.thermalcorrener: 0.280046 hartree
zpe.thermalcorrenthalpy: 0.280990 hartree
zpe.thermalcorrgfe: 0.213314 hartree
zpe.sumelectzpe: -1732.178499 hartree
zpe.sumelectthermal: -1732.160396 hartree
zpe.sumelectthermalent: -1732.159452 hartree
zpe.sumelectthermalfe: -1732.227127 hartree
dipole: 2.9696 -1.7270 -2.3628
dipole: 4.1693
quadrupole: -104.3134 -110.5040 -118.2637
quadrupole: 0.5287 16.3327 -7.8175
quadrupole: 6.7136 0.5231 -7.2366 0.5287 16.3327 -7.8175
hfenergy: -1732.4404413 hartree
pointgroup: C01 [X(C8H18N1O3P1S2)]
dipole: 1.0001155 -0.0861197 -1.2973357 debye
polarizability: 196.2997483|6.286509|155.9016188|-8.7298612|16.4739414|138.6649482 unknown
InChI: InChI=1S/C8H18NO3PS2/c1-4-11-13(10,12-5-2)9-8-14-6-7(3)15-8/h7-9H,4-6H2,1-3H3
charge 0 multiplicity 1
33 atoms
S  1.935449 -0.91918 -1.342135
S  1.930089 1.453673 0.647106
P  -1.656413 -0.363753 1.051133
O  -2.448845 -1.864497 0.71513
O  -2.080153 0.762044 -0.199943
O  -1.995213 0.10657 2.52799
N  -0.006707 -0.66547 0.561659
C  3.633507 -0.24504 -0.767108
C  0.808287 0.189953 -0.265572
C  3.436101 0.316526 0.651352
C  4.205569 0.769185 -1.768813
C  -2.283413 -2.548142 -0.602908
C  -2.919546 1.944464 0.179541
C  -3.332195 -2.078167 -1.614271
C  -2.043483 3.107122 0.649855
H  4.270346 -1.148387 -0.716462
H  0.162908 0.796196 -0.914229
H  3.280839 -0.486773 1.390793
H  4.29449 0.93865 0.958172
H  0.488057 -1.402306 1.072643
H  3.579703 1.677692 -1.800418
H  5.233249 1.059366 -1.473733
H  4.248747 0.339417 -2.783812
H  -1.252136 -2.386631 -0.974391
H  -2.410675 -3.614237 -0.349022
H  -3.462126 2.17964 -0.750993
H  -3.640059 1.645947 0.963025
H  -3.24618 -2.673474 -2.543275
H  -4.349581 -2.214019 -1.209073
H  -3.188464 -1.013611 -1.864753
H  -2.673769 3.996954 0.837629
H  -1.524484 2.849236 1.589049
H  -1.2935 3.372052 -0.115864
