program: Gaussian 09
title: 000186666
version: EM64L-G09RevD.01
frameworkgroup: C1[X(C4H11O2PS)]
method: RPBEPBE
basis: SDD
operation: Freq
keyword: #p
keyword: freq=noraman
keyword: PBEPBE/SDD
title: #p freq=noraman PBEPBE/SDD
converged: YES YES NO NO
title: Mulliken charges:
elementType: S P O O C C C C H H H H H H H H H H H
charge: -0.301563 0.798817 -0.481692 -0.471655 -0.211343 -0.851182 -0.650901 -0.477468 0.206915 0.234322 0.272272 0.283867 0.271983 0.208489 0.230989 0.231031 0.241292 0.220884 0.244943
chargesum: 0.00000
title: Mulliken charges with hydrogens summed into heavy atoms:
elementType: S P O O C C C C
charge: -0.301563 0.798817 -0.481692 -0.471655 0.229894 -0.023060 0.019608 0.229651
polarizability: 9.51440755e+01 1.04603558e+00 8.44065707e+01 -2.65084296e+00 -4.15142286e+00 9.58136223e+01
1716.lowfreq: -29.4373 -15.3734 0.0003 0.0012 0.0028 4.6139 15.1961 54.0746 70.1163
frequency: -23.6582 53.8216 70.0727 97.1334 132.6260 159.0763 169.1054 186.3807 230.4182 237.0178 258.8855 310.2717 371.6409 406.3854 483.9939 624.8346 655.0117 758.3984 807.5884 882.9693 962.6417 972.0021 986.8031 1027.1928 1104.1108 1113.7135 1134.9667 1137.2465 1255.3578 1347.4819 1354.4986 1393.1404 1422.9602 1433.1576 1437.1144 1458.7902 1460.0567 1470.5593 1477.1570 1486.9921 2968.7802 2974.5577 2993.8106 3030.8843 3037.9571 3067.7079 3090.3647 3107.5207 3115.9897 3152.9940 3161.4305
redmass: 2.1518 3.3269 3.0420 1.0595 3.6966 1.0168 4.0621 3.1439 3.9439 1.3117 4.1450 3.7652 4.7520 5.3538 8.1419 7.5416 5.1761 7.3339 1.1046 3.6672 2.1547 1.3482 2.5641 2.7995 2.1725 1.2415 1.3217 1.4659 1.1366 1.1688 1.2491 1.2422 1.1146 1.0437 1.0440 1.0411 1.0528 1.0521 1.0525 1.0751 1.0316 1.0547 1.0364 1.0315 1.1080 1.1043 1.0982 1.1019 1.1019 1.1020 1.1027
irintensity: 0.4476 2.0463 2.7500 0.0248 7.4478 0.0129 9.2087 3.4866 7.8639 0.8600 12.4891 4.8301 3.8504 15.1057 12.7663 109.1627 92.3408 37.4442 4.1489 141.2136 142.6832 73.3946 45.4849 97.4738 8.8981 0.4092 0.6905 6.0299 1.7168 19.2386 4.3558 23.9743 8.4476 12.5503 9.2250 10.7790 14.8783 15.6067 3.9059 9.8000 40.7083 49.5502 25.2433 0.7265 18.3632 29.4087 28.3429 34.7043 18.6633 1.3704 1.2806
temp: 298.150 k
press: 1.00000 atm
elementType: 16 15 8 8 6 6 6 6 1 1 1 1 1 1 1 1 1 1 1
symmnumber: 1
zpe: 394968.5 jmol-1
zpe.correction: 0.150436 hartree
zpe.thermalcorrener: 0.161740 hartree
zpe.thermalcorrenthalpy: 0.162684 hartree
zpe.thermalcorrgfe: 0.112750 hartree
zpe.sumelectzpe: -1048.080560 hartree
zpe.sumelectthermal: -1048.069256 hartree
zpe.sumelectthermalent: -1048.068311 hartree
zpe.sumelectthermalfe: -1048.118245 hartree
dipole: 0.9756 1.4530 -1.2919
dipole: 2.1753
quadrupole: -60.5747 -60.0888 -68.7553
quadrupole: -0.7886 3.7333 7.2021
quadrupole: 2.5649 3.0508 -5.6157 -0.7886 3.7333 7.2021
hfenergy: -1048.2309952 hartree
pointgroup: C01 [X(C4H11O2P1S1)]
dipole: 0.2123219 -0.7011132 -0.4425077 debye
dipolederiv: -0.4848164 0.0233014 0.0145976 0.0444434 -0.735334 -0.0570716 0.0154489 0.0167249 -0.4872145 1.7925788 -0.0382075 -0.0198646 -0.0753446 1.7021467 0.2524493 -0.0123861 0.0908166 1.355637 -1.2715752 0.1008385 0.4403312 0.0492068 -0.6231468 0.0276277 0.5642535 -0.0434753 -0.8383225 -0.9071495 -0.0903593 -0.3883106 -0.1017903 -0.6664828 -0.0506548 -0.4389823 -0.0904481 -0.9943823 0.6150618 -0.0070079 -0.2134414 0.3428313 0.1894512 -0.1523224 -0.458171 0.1090796 0.6059957 -0.2088306 0.0130433 0.0012038 -0.0000313 -0.2827164 0.1196832 0.0175329 -0.0327514 -0.214367 -0.1529175 0.0389768 0.021889 -0.0058333 0.0769779 0.0131441 0.0787259 -0.0138316 0.0130801 0.3389998 0.0223064 0.107666 -0.2133856 0.1314644 -0.1913109 0.267787 0.1109896 0.5959372 -0.0603128 -0.0279763 -0.0792843 -0.0632864 0.0591961 -0.0371748 0.0044643 -0.0320095 -0.1816148 0.0564433 0.0465529 0.0058411 -0.053105 -0.0850161 0.0487865 0.0381725 -0.0418588 0.0397418 -0.0048015 0.0255273 0.0637086 0.0212844 0.1006789 0.0084909 0.0771182 -0.0056597 0.0696578 0.1336804 0.0108918 0.0074954 0.0162626 -0.0590218 -0.0115223 0.0028199 0.0295816 0.0638886 0.0355157 -0.0331281 -0.0733429 -0.0351494 0.0903775 -0.0080334 -0.0781095 -0.0205919 0.0417251 -0.0343007 -0.0256854 0.1080792 -0.0530351 0.0628919 0.0878346 0.123281 0.0771426 -0.0379499 0.0593631 -0.0135733 -0.062796 -0.00873 0.0720206 -0.0695666 -0.1240367 -0.0558707 -0.0744018 0.0857538 -0.0085061 -0.0043162 0.0602055 -0.1353137 -0.0295847 -0.026866 -0.0125295 0.1078528 -0.1061002 -0.0825794 -0.0675347 -0.0876912 0.0856918 -0.008892 -0.0706287 0.0000178 0.0392418 -0.0123606 0.0436625 0.1239961 0.0596881 0.0833069 -0.0063424 0.0211907 -0.03553 -0.1595979 0.1257683 0.0019224 0.0140827 0.1034601 -0.0671723 0.0644596 -0.0016146 -0.0497962 0.0550928 unknown
polarizability: 93.8807556|-2.4834029|97.7848007|-2.6433617|0.5376778|83.6987122 unknown
InChI: InChI=1S/C4H11O2PS/c1-4-6-7(3,8)5-2/h4H2,1-3H3
charge 0 multiplicity 1
19 atoms
S  -0.702043 2.0998 1.107442
P  -0.556933 0.026536 1.119899
O  0.962338 -0.614736 0.543238
O  -1.810152 -0.799308 0.217412
C  1.702377 0.08484 -0.542061
C  -0.676828 -0.923512 2.695539
C  3.163402 -0.344208 -0.426577
C  -2.372329 -0.161491 -0.988142
H  1.268697 -0.219012 -1.514479
H  1.581275 1.179026 -0.416777
H  -1.652793 -0.724829 3.161067
H  -0.580027 -1.994172 2.459058
H  0.136431 -0.608779 3.365222
H  3.754831 0.119345 -1.23802
H  3.587228 -0.02762 0.541376
H  3.257358 -1.440437 -0.509471
H  -3.367748 -0.612704 -1.118861
H  -1.741246 -0.379007 -1.869161
H  -2.462538 0.932565 -0.847407
