program: Gaussian 09
title: 000015716
version: EM64L-G09RevD.01
frameworkgroup: C1[X(C9H16)]
method: RPBEPBE
basis: SDD
operation: Freq
keyword: #p
keyword: freq=noraman
keyword: PBEPBE/SDD
title: #p freq=noraman PBEPBE/SDD
converged: YES YES NO NO
title: Mulliken charges:
elementType: C C C C C C C C C H H H H H H H H H H H H H H H H
charge: -0.041116 -0.450236 -0.077416 -0.527700 0.428690 -0.410514 -0.746117 -0.720237 -0.832056 0.214668 0.203168 0.191309 0.199314 0.205385 0.204809 0.212851 0.211615 0.206908 0.216214 0.215297 0.219218 0.211152 0.227051 0.219213 0.218529
chargesum: 0.00000
title: Mulliken charges with hydrogens summed into heavy atoms:
elementType: C C C C C C C C C
charge: 0.173553 -0.055759 0.121899 -0.117506 0.428690 -0.197663 -0.111380 -0.074571 -0.167263
polarizability: 1.00493881e+02 -4.16320981e+00 1.08730495e+02 -1.08277150e+00 2.42236764e+00 7.40573014e+01
1716.lowfreq: -27.1762 -14.9757 -5.8857 -0.0007 0.0004 0.0007 100.4377 135.8706 144.8586
frequency: 100.4186 135.8629 144.8554 182.8880 215.7752 221.2544 254.8442 306.4911 368.9452 380.8246 418.6805 439.8509 477.6327 490.3892 645.3636 801.0128 816.6657 839.9572 862.6287 874.1332 934.5023 945.9505 957.9470 998.2554 1010.2497 1035.1709 1041.2283 1084.0184 1108.3332 1131.0560 1167.6933 1173.4155 1187.0816 1248.3038 1278.6139 1289.8062 1301.7020 1329.3492 1337.3808 1350.7434 1359.7628 1381.2309 1387.3042 1392.8671 1449.9348 1459.9615 1462.8992 1470.4244 1473.5020 1476.0474 1477.6950 1478.8180 1691.3225 2933.7934 2946.2561 2955.2805 2960.7670 2963.7166 2969.5759 2972.5727 2991.0463 3023.2032 3025.1572 3058.0160 3064.4213 3066.0071 3073.0471 3074.8135 3082.4130
redmass: 2.1412 2.1425 2.5767 1.1453 1.0483 1.0619 2.3202 2.3798 2.5033 2.2639 2.1436 3.6500 2.5178 2.7246 2.9118 2.4875 1.6761 1.8416 2.0445 1.5144 1.9091 1.7427 1.6438 1.4221 1.3899 1.3855 1.7549 2.3593 1.7829 1.4827 1.9733 2.0048 1.6645 1.3750 1.4598 1.2521 1.4172 1.4787 1.4386 1.7434 1.8757 1.2155 1.2203 1.2416 1.0850 1.0542 1.0736 1.0584 1.0606 1.0495 1.0559 1.0562 6.8084 1.0630 1.0769 1.0380 1.0773 1.0386 1.0510 1.0509 1.0955 1.1018 1.0966 1.0990 1.0993 1.0994 1.0990 1.0981 1.0909
irintensity: 0.0956 1.0001 0.5583 0.0370 0.0286 0.0371 0.1936 0.3295 1.6718 3.2588 0.1863 0.5019 2.0399 0.6606 1.2714 0.5254 9.4670 2.5324 2.1116 11.7015 2.5929 3.0893 4.2695 0.7937 2.4773 4.6075 3.3035 3.3431 3.4152 3.2183 0.6557 3.9582 3.0091 2.4778 1.4560 3.5549 2.3501 1.4920 1.8792 3.3118 10.7124 13.7923 11.6301 12.0581 3.6019 14.9412 5.0831 17.2830 0.9958 8.7100 6.0309 18.0944 3.3036 31.7130 19.4055 57.2920 22.9342 32.0101 69.4118 37.9762 41.4461 33.8871 39.1760 55.8241 24.3710 64.1156 46.4024 7.5147 67.9869
temp: 298.150 k
press: 1.00000 atm
elementType: 6 6 6 6 6 6 6 6 6 1 1 1 1 1 1 1 1 1 1 1 1 1 1 1 1
symmnumber: 1
zpe: 592218.1 jmol-1
zpe.correction: 0.225564 hartree
zpe.thermalcorrener: 0.235736 hartree
zpe.thermalcorrenthalpy: 0.236680 hartree
zpe.thermalcorrgfe: 0.191105 hartree
zpe.sumelectzpe: -351.819800 hartree
zpe.sumelectthermal: -351.809628 hartree
zpe.sumelectthermalent: -351.808684 hartree
zpe.sumelectthermalfe: -351.854259 hartree
dipole: -0.0655 -0.2226 -0.0315
dipole: 0.2342
quadrupole: -56.9993 -56.4188 -58.3492
quadrupole: -0.6489 -0.2004 0.7415
quadrupole: 0.2565 0.8370 -1.0934 -0.6489 -0.2004 0.7415
hfenergy: -352.0453641 hartree
pointgroup: C01 [X(C9H16)]
dipole: -0.0304791 0.0862383 0.0110805 debye
dipolederiv: 0.098181 -0.0041192 -0.0138186 0.0251485 0.0547618 -0.0176637 -0.0338326 -0.0186539 0.1202077 0.0579876 0.0545706 -0.006932 0.0346119 -0.0299402 -0.042393 -0.0005505 -0.0138341 0.104367 0.0558156 0.0367831 -0.0051103 -0.0461027 0.0851228 -0.0071905 0.0140206 0.0399871 0.2156928 -0.139155 -0.0070205 0.0008869 0.0576328 0.0239112 -0.0148785 0.0007793 0.0162661 0.1977135 0.2239433 -0.0133697 0.0431708 -0.0297041 0.2252559 0.0467007 0.0430925 0.0216236 -0.1207805 0.0655443 0.0406167 -0.0024357 -0.0207877 -0.0644327 0.0585693 0.0275395 0.0683447 -0.2925086 -0.0258891 0.0673178 -0.0074889 0.0548888 0.0204892 0.0003307 0.0130684 -0.013643 0.1062963 0.021239 -0.0567074 0.0135871 0.0015643 0.0264782 0.0751067 -0.0085322 0.0282017 -0.0072345 -0.1080975 -0.0143479 -0.0099079 -0.0549919 0.0104408 -0.0144623 -0.0237728 -0.0247999 0.1025613 0.0261453 0.0009432 -0.0193629 -0.0153971 0.012447 0.088291 0.0000756 0.0739648 -0.1579978 0.0741063 0.0145956 0.0237021 0.0296529 -0.0133482 0.1131422 -0.0192635 0.0632617 -0.1556448 -0.1841209 -0.1156142 -0.0062685 -0.1096078 0.0099793 -0.0141499 0.0357674 0.002128 0.0665595 0.0083402 -0.0215551 0.0168295 0.0096988 -0.0792313 -0.1084871 0.0056438 -0.1314502 -0.1229597 0.0384061 -0.0241041 -0.0374742 -0.0448246 -0.0691745 -0.1086264 -0.0339294 -0.1676953 -0.0509402 0.0423593 0.0623753 -0.0095222 0.0062026 -0.0453867 0.0848109 0.0009494 0.1485583 -0.0836632 -0.1424113 0.0975793 0.0008414 0.1086107 -0.0144127 -0.0205493 -0.0152522 -0.0225869 0.1427788 0.0754412 -0.03192 -0.0368251 0.0343577 -0.115604 -0.1201994 0.0013975 -0.1411236 -0.0100913 0.0697286 -0.0003294 0.0318547 0.024223 0.0491508 0.0518567 -0.0403772 0.1073292 -0.1506288 -0.1620562 -0.0456434 0.0455923 -0.1247149 0.0328754 0.0339825 0.0419227 0.0231592 0.0791101 -0.0511847 0.1722802 -0.0418971 0.1190509 -0.0371521 0.0530354 -0.022859 0.0264784 0.0678809 0.0776741 0.0023826 0.0348172 0.0177925 0.0240904 -0.1385651 0.0443744 -0.0729405 -0.0882433 -0.1253947 -0.1879813 -0.0195442 -0.1221669 -0.032611 0.004496 -0.0346476 -0.0040045 0.0606395 -0.0847026 0.0685658 0.012556 0.1736912 -0.0251291 -0.0231453 0.0246287 -0.0224475 0.0979096 0.0410439 -0.0469033 0.0072322 -0.0510967 0.0230826 -0.0991359 -0.0716061 -0.1341795 -0.1096437 0.0470561 -0.0483946 -0.0144827 -0.0777321 -0.0716629 0.1191241 0.0513633 0.1480564 -0.0113807 unknown
polarizability: 100.0671683|3.7066752|109.2242781|0.8957803|1.9430108|73.9902307 unknown
InChI: InChI=1S/C9H16/c1-7-4-8(2)6-9(3)5-7/h4,7,9H,5-6H2,1-3H3
charge 0 multiplicity 1
25 atoms
C  -1.168527 0.721469 0.296156
C  -1.291046 -0.485374 -0.666736
C  -0.17637 -1.541127 -0.437436
C  0.191852 1.425162 0.069324
C  1.366325 0.458342 -0.031259
C  1.178923 -0.872802 -0.252662
C  -2.346331 1.70477 0.133371
C  -0.498488 -2.490302 0.751431
C  2.748284 1.066126 0.120031
H  -1.179721 0.334517 1.336849
H  -1.230388 -0.107205 -1.708388
H  -2.285429 -0.96203 -0.553741
H  -0.11619 -2.177665 -1.346741
H  0.380953 2.149295 0.889446
H  0.140111 2.036004 -0.859734
H  2.058113 -1.533435 -0.300416
H  -2.235404 2.580354 0.801031
H  -2.403157 2.079935 -0.907167
H  -3.311289 1.218288 0.369375
H  0.323665 -3.210339 0.920885
H  -0.638216 -1.918585 1.686993
H  -1.42271 -3.066363 0.554927
H  3.545772 0.31377 -0.011274
H  2.87469 1.530831 1.118588
H  2.911977 1.871664 -0.624153
