program: Gaussian 09
title: 000186623
version: EM64L-G09RevD.01
frameworkgroup: C1[X(C9H8Cl3NO2)]
method: RPBEPBE
basis: SDD
operation: Freq
keyword: #p
keyword: freq=noraman
keyword: PBEPBE/SDD
title: #p freq=noraman PBEPBE/SDD
converged: YES YES NO NO
title: Mulliken charges:
elementType: Cl Cl Cl O O N C C C C C C C C C H H H H H H H H
charge: -0.040040 0.002626 0.002814 -0.300507 -0.267627 -0.457938 0.666453 -0.406937 -0.279204 -0.082168 -0.206274 -0.120882 -0.216093 0.270974 -0.670746 0.334934 0.342049 0.283598 0.232787 0.232757 0.216070 0.231677 0.231677
chargesum: 0.00000
title: Mulliken charges with hydrogens summed into heavy atoms:
elementType: Cl Cl Cl O O N C C C C C C C C C
charge: -0.040040 0.002626 0.002814 -0.300507 -0.267627 -0.115890 0.666453 -0.406937 0.055731 -0.082168 0.077324 -0.120882 0.249451 0.270974 0.008678
polarizability: 2.27135701e+02 8.04964336e+00 1.57207273e+02 -1.92843577e-02 4.61557546e-03 6.19708441e+01
1716.lowfreq: -5.5558 -4.4312 -0.0029 -0.0028 -0.0023 3.2285 30.7264 46.8160 67.3118
frequency: 30.6859 46.8065 67.3103 68.9623 80.5743 122.5253 158.8433 167.1523 177.9901 188.9080 236.1188 248.4288 249.2233 305.0758 313.2366 360.8135 365.3195 443.5091 445.6415 487.4204 526.5937 608.0392 652.5205 668.9526 695.8460 711.5686 725.2738 730.7984 801.4979 840.9335 849.8624 907.2155 909.3519 985.4111 1024.2275 1048.3610 1112.5716 1117.7897 1139.4310 1172.0643 1239.0585 1249.4484 1251.7792 1354.1478 1366.6470 1378.1421 1401.9078 1440.3898 1463.4195 1475.8208 1488.0814 1504.8114 1565.9273 1604.7918 1656.4328 2998.5606 3012.1783 3071.9083 3095.7255 3110.2432 3179.9790 3185.8649 3504.2238
redmass: 3.7258 4.0452 5.6165 6.5709 5.2220 4.4428 6.7026 5.3899 22.3199 12.8718 3.7316 1.3885 10.7663 8.9262 20.6110 9.8297 3.9606 3.2380 9.7738 6.0761 8.1840 8.6834 7.6799 1.8388 4.9441 8.1218 2.1556 6.4299 1.0956 4.2258 1.4188 6.6882 1.3914 4.5524 3.9758 3.8873 2.2436 1.9343 1.4596 3.2893 1.2475 3.5539 1.1312 1.8997 2.3888 8.1653 1.2639 2.5808 1.0400 1.0665 1.1241 2.9769 4.9269 7.5107 7.9271 1.0359 1.0581 1.1071 1.0986 1.1028 1.0927 1.0933 1.0761
irintensity: 0.2876 0.0063 0.3706 3.7198 0.1430 4.2496 2.3434 2.4472 0.9897 2.4054 0.3695 1.7682 0.0441 15.3980 2.3290 0.2206 3.2437 18.9946 14.0785 1.3402 34.3862 1.8099 32.8315 15.1820 2.8934 9.5014 89.4695 5.1633 4.4883 1.3375 12.2111 21.5341 39.5842 70.4478 122.9982 191.0710 18.1755 14.1582 5.2375 590.7442 38.4880 9.4740 0.0009 78.3942 54.8606 6.9129 28.4052 51.4296 12.6689 31.6718 66.5237 635.3372 74.6779 153.3651 183.4697 20.2867 21.2693 7.4043 27.9934 43.2642 27.3755 0.2078 62.8339
temp: 298.150 k
press: 1.00000 atm
elementType: 17 17 17 8 8 7 6 6 6 6 6 6 6 6 6 1 1 1 1 1 1 1 1
symmnumber: 1
zpe: 409077.1 jmol-1
zpe.correction: 0.155809 hartree
zpe.thermalcorrener: 0.171263 hartree
zpe.thermalcorrenthalpy: 0.172208 hartree
zpe.thermalcorrgfe: 0.110737 hartree
zpe.sumelectzpe: -1932.048056 hartree
zpe.sumelectthermal: -1932.032601 hartree
zpe.sumelectthermalent: -1932.031657 hartree
zpe.sumelectthermalfe: -1932.093128 hartree
dipole: 3.8021 1.8219 0.0006
dipole: 4.2160
quadrupole: -94.0186 -111.0395 -108.7169
quadrupole: -4.9824 0.0058 -0.0019
quadrupole: 10.5731 -6.4479 -4.1252 -4.9824 0.0058 -0.0019
hfenergy: -1932.2038648 hartree
pointgroup: C01 [X(C9H8Cl3N1O2)]
dipole: -1.4360235 -0.8301518 -0.0007093 debye
dipolederiv: -0.2418366 -0.2238348 -0.0002269 -0.2108918 -0.6611787 -0.0003928 -0.0002264 -0.0003906 -0.0397791 -0.1737899 -0.2101502 -0.0001687 -0.3039576 -0.6250196 -0.0004024 -0.0002156 -0.0003592 -0.0261361 -0.8374173 -0.0470777 -0.0005955 -0.0274151 -0.0637966 -0.0000333 -0.0006447 -0.0000482 -0.0218883 -2.2909186 0.0086527 -0.0001322 -0.3011801 -0.4588309 -0.0002393 0.001241 -0.0000515 -0.3078649 -0.8047442 -0.0123387 -0.0000642 0.199114 -0.9277251 0.0005011 0.0002818 -0.0007867 -0.3325171 -2.2045563 0.2901936 -0.0005823 0.71793 -0.5570817 0.0000807 -0.0008561 0.0000227 -0.3115055 1.5500471 -0.1835711 0.0007691 0.2408344 -0.1754788 0.0000116 0.0010734 -0.0001752 0.1272915 -0.0607111 0.3056673 0.0002425 0.4470212 0.9454184 0.0007348 0.0000448 0.0006044 -0.1290603 -0.3935688 0.0205683 -0.0001292 -0.2673837 -0.2293621 -0.0002125 -0.0002782 -0.0000106 -0.1063899 0.1483437 0.3182706 0.0002174 0.4175954 1.008858 0.0006151 0.00032 0.0005975 -0.0429093 -0.1860364 0.0364221 -0.0001226 -0.1272831 -0.149606 -0.0001501 -0.0001536 -0.0000317 -0.0201298 1.0408957 -0.0438129 0.0008274 0.0276765 -0.2081886 -0.0000182 0.0008745 -0.0000869 -0.078042 1.1663176 -0.1007634 -0.0001363 -0.3838251 0.2853008 0.0000118 -0.0005332 -0.000031 0.3544285 2.8960474 -0.1865576 0.0003948 -0.5303301 1.3924833 -0.0005226 -0.0006951 0.000677 0.3187137 -0.1487468 -0.0630326 0.0000643 -0.0253552 0.0180434 0.0000675 0.0001223 0.000048 0.0616959 0.2195864 0.0052154 -0.0000146 -0.0184027 0.0914258 -0.0000532 -0.0000549 -0.000039 0.1840359 0.2446567 0.0038836 -0.0000999 -0.0546383 0.2443082 -0.0000045 -0.0001323 0.0000247 0.3182508 0.077377 0.0250064 -0.0000572 0.0320228 0.0428777 -0.0000179 -0.0000411 -0.0000122 0.1696366 -0.0559358 -0.0202868 -0.0362448 0.0843181 -0.0060126 -0.0842227 -0.0000702 -0.1021899 -0.0572328 -0.0558656 -0.0201503 0.0361187 0.0844821 -0.0061482 0.0842651 0.000035 0.1023013 -0.0572291 -0.1208459 0.0887913 0.0001419 0.114996 0.0133479 -0.0001082 0.0001994 -0.0000937 0.118635 0.1158513 0.0043658 0.0192629 -0.0577401 0.0132422 -0.1059974 -0.0108163 -0.1129627 -0.0610668 0.1158505 0.0045393 -0.0194647 -0.0575877 0.0131231 0.1060874 0.0105254 0.1129936 -0.060937 unknown
polarizability: 225.4790408|13.3377733|158.8638714|0.0891063|0.0459571|61.9709057 unknown
InChI: InChI=1S/C9H8Cl3NO2/c1-2-15-9(14)13-8-4-6(11)5(10)3-7(8)12/h3-4,13H,2H2,1H3
charge 0 multiplicity 1
23 atoms
Cl 0.477316 -3.159219 -0.001743
Cl 2.988183 2.753036 0.002176
Cl 4.950455 0.103154 0.002794
O  -3.307531 -0.242344 -0.002064
O  -1.9171 1.657336 -0.001062
N  -1.077104 -0.562878 -0.002068
C  0.315078 -0.352467 -0.000917
C  1.188265 -1.475429 -0.00063
C  0.904623 0.940031 -0.000029
C  2.303628 1.07986 0.001089
C  2.583308 -1.341027 0.000482
C  3.149725 -0.049164 0.001356
C  -4.504576 0.652148 -0.000943
C  -2.070868 0.411082 -0.002504
C  -5.727856 -0.257407 -0.000326
H  0.254809 1.817683 -0.000243
H  -1.402488 -1.534657 -0.00255
H  3.22633 -2.223998 0.000673
H  -4.454507 1.296707 0.894967
H  -4.455771 1.297199 -0.896568
H  -6.646343 0.357007 0.000481
H  -5.742369 -0.90159 -0.895835
H  -5.741109 -0.902063 0.894863
