program: Gaussian 09
title: 000186642
version: EM64L-G09RevD.01
frameworkgroup: C1[X(C14H30O4S)]
method: RPBEPBE
basis: SDD
operation: Freq
keyword: #p
keyword: freq=noraman
keyword: PBEPBE/SDD
title: #p freq=noraman PBEPBE/SDD
converged: YES YES NO NO
title: Mulliken charges:
elementType: S O O O O C C C C C C C C C C C C C C H H H H H H H H H H H H H H H H H H H H H H H H H H H H H H
charge: 1.189246 -0.387879 -0.377937 -0.494043 -0.487804 -0.385502 -0.384305 -0.383835 -0.382199 -0.378029 -0.372672 -0.379621 -0.353368 -0.384589 -0.356608 -0.293615 -0.696355 -0.270343 -0.644453 0.195447 0.194292 0.193336 0.194173 0.196172 0.194702 0.192054 0.192717 0.196784 0.199327 0.189915 0.189343 0.200550 0.197462 0.187547 0.188009 0.224703 0.220059 0.195013 0.194673 0.244265 0.227258 0.209569 0.215344 0.209807 0.238645 0.248141 0.226093 0.251414 0.217096
chargesum: 0.00000
title: Mulliken charges with hydrogens summed into heavy atoms:
elementType: S O O O O C C C C C C C C C C C C C C
charge: 1.189246 -0.387879 -0.377937 -0.494043 -0.487804 0.004237 0.003203 0.007039 0.002573 0.018082 0.006586 0.018391 0.022188 0.060173 0.033078 0.177908 -0.061636 0.216443 0.050151
polarizability: 2.89462356e+02 7.26332320e+00 1.77401329e+02 -6.95939109e-01 1.23068377e+00 1.61654325e+02
1716.lowfreq: -18.5329 -0.0022 -0.0017 -0.0012 2.0142 4.9391 11.1939 17.4461 21.4247
frequency: -14.6065 17.0920 21.3653 26.0225 36.9913 46.8160 52.7307 56.7302 68.4729 83.4667 90.9814 98.6409 108.8759 120.8600 123.5970 133.5397 147.2247 156.9957 164.3910 175.5137 199.4288 228.1516 230.0322 232.3474 249.5531 273.6454 305.6839 337.2348 351.5144 382.9631 419.6714 435.5803 463.2912 480.0377 497.2746 502.2126 579.7822 720.2100 722.7969 729.3529 743.2457 766.6010 783.3210 796.4514 812.7094 839.8533 853.8421 887.7430 889.9849 894.5511 942.3450 979.8905 985.7017 991.6622 995.2216 1002.5845 1015.0955 1031.0988 1031.9554 1050.0326 1066.7931 1075.4870 1080.7497 1081.6462 1088.1367 1090.9164 1123.3241 1125.2369 1148.1385 1181.4714 1201.7705 1204.4873 1227.0777 1235.1337 1251.6301 1256.2318 1262.6909 1269.7858 1278.6162 1280.8050 1288.4472 1289.0485 1291.4856 1297.5480 1298.4962 1313.7195 1334.9983 1340.0712 1349.2105 1351.4235 1354.3501 1356.8386 1358.0518 1386.7975 1396.6274 1440.4801 1459.1152 1459.3027 1462.3402 1462.6314 1462.9485 1465.9876 1467.5135 1471.5576 1475.6374 1476.5637 1476.8591 1481.1246 1485.1652 1488.2509 1490.0968 2948.7948 2949.0771 2950.9502 2952.2124 2955.4033 2958.5760 2962.3948 2967.2295 2968.6666 2971.3429 2981.9276 2985.7868 2989.5846 2991.2264 2991.8425 2998.1421 3001.6350 3002.2164 3006.2609 3016.1386 3026.5930 3036.0348 3043.0124 3052.4647 3062.8289 3067.7492 3070.3959 3079.1824 3087.4945 3107.8206
redmass: 2.5899 3.8975 4.6269 2.2991 2.7417 2.7503 2.0812 4.0352 2.3786 2.3788 2.8746 3.1228 2.6573 5.0009 2.2392 2.0944 2.0149 2.1304 4.2547 2.4619 5.4900 4.2918 1.1340 2.1736 2.4483 4.9832 3.9756 5.5847 4.9601 3.7277 5.0334 3.4011 3.6671 4.3819 3.0671 6.6800 10.1507 1.0590 1.0685 1.0834 1.1056 1.1310 1.2142 1.1619 3.4159 1.2130 15.1817 1.8803 1.2379 8.8338 1.2039 5.1750 6.0520 1.2131 6.4004 2.3741 4.0185 1.1526 2.9695 3.2595 2.7632 2.7023 2.2305 2.1417 2.7147 2.2234 2.9407 1.5782 1.3462 1.8554 1.5642 1.2669 1.4101 1.2965 1.3066 1.1308 1.2900 1.1806 1.0791 1.0655 1.1152 1.2396 1.1184 1.1014 1.1169 1.3258 1.3798 1.2092 1.4744 1.5453 1.5880 1.6073 1.5008 1.2168 1.2207 1.0840 1.0743 1.0730 1.0576 1.0563 1.0686 1.0687 1.0751 1.0825 1.0530 1.0794 1.0438 1.0878 1.0908 1.0899 1.0944 1.0586 1.0586 1.0591 1.0592 1.0592 1.0590 1.0588 1.0588 1.0585 1.0363 1.0963 1.0974 1.0559 1.0989 1.0363 1.1006 1.0581 1.0584 1.1023 1.1041 1.1048 1.1048 1.1046 1.1059 1.1057 1.1007 1.0993 1.1082 1.0978 1.1024
irintensity: 0.4080 0.7481 0.3401 0.1027 1.0652 0.5388 0.1630 0.6456 0.9287 0.2903 0.1682 0.8412 0.5965 0.6876 0.0347 0.2932 0.0270 0.0723 0.8051 3.8221 1.1516 1.1127 0.0217 2.0352 1.6461 8.6050 1.0064 14.8081 2.6289 0.9122 31.0000 3.9291 5.3840 21.2627 1.9971 94.4049 131.0752 17.3127 0.3579 7.5351 0.2855 3.2300 4.3140 0.0040 27.9047 2.4734 115.3688 7.3804 0.8202 26.9489 0.1464 2.1305 24.6377 1.9448 43.9087 53.0700 6.7320 0.9958 9.6052 0.8110 0.5296 2.0740 0.8131 0.2113 4.5706 6.8026 31.7136 16.6008 1.1015 0.0236 0.1763 37.1213 0.0227 2.8276 0.0630 4.3532 2.0244 0.1260 0.0036 0.5125 0.1550 0.6380 0.1596 0.1276 0.0127 0.1814 0.3422 25.4113 0.1548 4.7644 0.7314 0.5339 1.8450 11.0418 23.8485 14.5265 0.0173 0.0064 5.6397 7.2085 2.5363 2.4380 1.9828 3.4898 11.7176 2.7170 12.9274 6.1486 1.2672 18.8727 37.1048 0.0266 0.0671 0.1148 0.9210 0.5603 3.4644 31.4377 49.2511 230.5332 39.4304 0.0782 0.0310 20.7740 0.0542 13.8621 0.2646 14.1769 41.0919 0.6872 0.0181 5.1870 6.2204 237.7617 20.6709 5.2965 97.7460 55.3677 70.6283 27.5987 19.9553
temp: 298.150 k
press: 1.00000 atm
elementType: 16 8 8 8 8 6 6 6 6 6 6 6 6 6 6 6 6 6 6 1 1 1 1 1 1 1 1 1 1 1 1 1 1 1 1 1 1 1 1 1 1 1 1 1 1 1 1 1 1
symmnumber: 1
zpe: 1110198.9 jmol-1
zpe.correction: 0.422852 hartree
zpe.thermalcorrener: 0.448277 hartree
zpe.thermalcorrenthalpy: 0.449221 hartree
zpe.thermalcorrgfe: 0.362802 hartree
zpe.sumelectzpe: -1248.654109 hartree
zpe.sumelectthermal: -1248.628684 hartree
zpe.sumelectthermalent: -1248.627740 hartree
zpe.sumelectthermalfe: -1248.714160 hartree
dipole: -3.0504 3.2842 -0.8472
dipole: 4.5617
quadrupole: -146.1553 -125.6278 -133.5802
quadrupole: 25.2851 -5.5794 -3.1750
quadrupole: -11.0342 9.4933 1.5409 25.2851 -5.5794 -3.1750
hfenergy: -1249.0769614 hartree
pointgroup: C01 [X(C14H30O4S1)]
dipole: -1.1183209 -1.0148226 0.9697634 debye
polarizability: 289.8920025|1.1975879|174.1023305|1.9914484|-6.0614524|164.5236773 unknown
InChI: InChI=1S/C14H30O4S/c1-3-5-6-7-8-9-10-11-12-13-14-18-19(15,16)17-4-2/h3-14H2,1-2H3
charge 0 multiplicity 1
49 atoms
S  6.210651 1.128294 -0.760756
O  4.599221 0.244733 -0.969902
O  6.669528 0.691355 0.985077
O  7.219652 0.409213 -1.782799
O  5.963093 2.71385 -0.737572
C  -2.904261 -0.320719 -0.428561
C  -4.217416 0.276332 0.125417
C  -1.652241 0.501804 -0.048832
C  -5.471157 -0.543659 -0.253821
C  -0.338847 -0.098616 -0.598846
C  -6.78371 0.051503 0.303989
C  0.908722 0.730428 -0.21782
C  -8.038328 -0.767315 -0.075067
C  2.218059 0.11163 -0.767946
C  -9.350436 -0.173149 0.486047
C  3.435539 0.963833 -0.381444
C  -10.598513 -0.997904 0.103511
C  7.484892 -0.552004 1.098957
C  6.650185 -1.829135 0.985337
H  -2.97304 -0.394461 -1.534142
H  -2.787935 -1.359608 -0.054647
H  -4.148923 0.349361 1.231205
H  -4.333513 1.315683 -0.247339
H  -1.768034 1.539429 -0.425932
H  -1.5864 0.578258 1.056738
H  -5.354471 -1.583891 0.116483
H  -5.541982 -0.614369 -1.359584
H  -0.22178 -1.134923 -0.219285
H  -0.404746 -0.176014 -1.703847
H  -6.900442 1.092005 -0.065633
H  -6.71313 0.121628 1.409913
H  0.79382 1.763737 -0.604734
H  0.970281 0.812165 0.886957
H  -7.922644 -1.808584 0.292818
H  -8.112181 -0.835839 -1.180846
H  2.16632 0.033057 -1.869958
H  2.348035 -0.912217 -0.369663
H  -9.465775 0.866886 0.117761
H  -9.275414 -0.104413 1.590725
H  3.37069 1.981783 -0.808341
H  3.552003 1.026355 0.717522
H  -10.52118 -2.033546 0.485505
H  -11.522167 -0.553103 0.517637
H  -10.714031 -1.054861 -0.995506
H  7.91739 -0.425234 2.109302
H  8.303162 -0.524839 0.354999
H  5.813072 -1.817399 1.704237
H  6.239675 -1.950209 -0.031795
H  7.28541 -2.707525 1.205378
