program: Gaussian 09
title: 000184719
version: EM64L-G09RevD.01
frameworkgroup: C1[X(C14H16N)]
method: RPBEPBE
basis: SDD
operation: Freq
keyword: #p
keyword: freq=noraman
keyword: PBEPBE/SDD
title: #p freq=noraman PBEPBE/SDD
converged: NO YES NO NO
title: Mulliken charges:
elementType: N C C C C C C C C C C C C C C H H H H H H H H H H H H H H H H
charge: -0.068087 -0.074423 -0.643111 -0.643143 0.272953 -0.147560 -0.098147 -0.298280 -0.321715 0.296206 -0.372903 -0.372908 -0.204180 -0.204177 -0.219622 0.226832 0.224619 0.260996 0.244469 0.244474 0.261004 0.224603 0.283217 0.292871 0.291127 0.290377 0.247693 0.247694 0.251898 0.251898 0.255320
chargesum: 1.00000
title: Mulliken charges with hydrogens summed into heavy atoms:
elementType: N C C C C C C C C C C C C C C
charge: -0.068087 0.152409 0.086973 0.086938 0.272953 0.135658 0.194724 -0.007153 -0.031338 0.296206 -0.125210 -0.125213 0.047719 0.047721 0.035698
polarizability: 2.30004801e+02 1.48555325e-03 1.20688217e+02 -1.73373704e+00 -1.39902742e-02 1.08392502e+02
1716.lowfreq: -84.9889 -6.7779 -0.0005 -0.0003 0.0004 3.8767 9.0535 27.1543 49.1912
frequency: -84.9850 26.5621 49.0298 71.3976 129.3430 200.8543 219.2051 236.9368 252.0696 267.5344 314.2045 339.2549 382.8431 395.4269 434.9613 477.6775 531.1434 572.1902 573.1160 613.7611 655.2241 670.4354 705.3831 751.4279 764.5989 772.7580 849.9356 855.8009 858.2516 887.4105 925.1617 927.4304 947.4760 975.2239 978.6839 984.5628 985.4879 1004.3049 1009.4200 1040.6178 1045.3642 1068.5320 1085.3538 1108.0379 1140.4409 1144.5351 1182.7237 1182.7504 1194.4297 1221.6997 1293.2823 1301.7543 1309.3676 1312.0352 1315.5340 1369.2043 1393.9916 1395.2039 1414.1488 1428.7873 1448.6858 1461.3276 1468.5766 1469.3254 1482.3449 1483.1678 1504.6821 1540.5936 1582.3718 1604.5946 1626.9152 2999.0811 3000.7591 3039.4897 3096.2641 3103.8720 3105.7649 3109.5375 3136.3627 3136.6669 3152.3920 3163.0258 3178.6708 3180.5896 3182.8913 3198.0773 3208.5800
redmass: 3.7917 2.9843 3.6027 4.4878 3.6110 3.4464 1.0778 2.9670 1.2033 3.6528 3.6039 2.7624 2.7958 2.7313 3.9568 3.2192 3.5245 2.7789 3.1594 5.8266 6.4823 4.4710 1.8546 3.8799 1.7843 5.2615 1.2420 1.3239 1.4651 2.5944 1.3541 1.1944 1.4180 1.3576 1.3822 1.3797 6.2284 5.5346 1.3325 2.1626 2.8731 1.6722 1.6267 2.0753 2.2375 2.2004 1.0533 1.8651 1.1174 1.1752 2.1758 2.5368 1.4718 1.3377 1.3861 6.4054 1.9116 1.1877 1.2216 2.1716 2.3540 1.0455 1.0466 1.9318 1.0905 1.0557 2.5161 5.9439 5.8114 6.0154 5.5879 1.0365 1.0372 1.0868 1.1006 1.0998 1.1007 1.1001 1.0878 1.0893 1.0914 1.0963 1.1017 1.0907 1.0922 1.0988 1.0986
irintensity: 0.0007 0.0468 0.0884 0.3233 0.1831 1.3190 0.1308 1.9012 0.6123 0.3736 0.3911 0.6203 0.0033 0.0062 0.1430 1.5919 15.9188 30.8157 0.1106 2.0975 0.5065 5.7593 49.6102 0.1344 54.4308 1.5665 0.0069 10.4190 40.0111 1.2129 1.0682 2.8939 0.2241 0.0396 0.0001 0.0017 9.8946 15.6384 0.0978 0.1964 10.7257 5.0433 6.1423 23.3753 6.2369 104.6288 0.0253 4.2465 1.0441 0.8905 16.8779 0.2671 1.2020 0.5905 1.4032 0.0001 0.9608 24.0282 11.5390 13.4234 33.2587 0.0912 8.0171 27.3726 36.6398 17.4507 27.3151 11.0378 2.2694 0.0009 131.3055 6.3541 2.9671 3.8135 2.7608 29.5311 9.2739 13.2041 1.5752 2.3621 2.4009 13.1255 9.1281 0.1703 0.4500 1.6857 0.4728
temp: 298.150 k
press: 1.00000 atm
elementType: 7 6 6 6 6 6 6 6 6 6 6 6 6 6 6 1 1 1 1 1 1 1 1 1 1 1 1 1 1 1 1
symmnumber: 1
zpe: 689102.2 jmol-1
zpe.correction: 0.262465 hartree
zpe.thermalcorrener: 0.275327 hartree
zpe.thermalcorrenthalpy: 0.276271 hartree
zpe.thermalcorrgfe: 0.222258 hartree
zpe.sumelectzpe: -596.541730 hartree
zpe.sumelectthermal: -596.528868 hartree
zpe.sumelectthermalent: -596.527924 hartree
zpe.sumelectthermalfe: -596.581937 hartree
dipole: -6.1089 -0.0009 0.5036
dipole: 6.1296
quadrupole: -28.0390 -80.0000 -78.2119
quadrupole: 0.0021 -1.4928 -0.0136
quadrupole: 34.0447 -17.9164 -16.1283 0.0021 -1.4928 -0.0136
hfenergy: -596.8041952 hartree
pointgroup: C01 [X(C14H16N1)]
dipole: 2.4046367 -0.0000927 -0.1827723 debye
polarizability: 230.0219998|0.0043356|120.6881858|-0.9560366|0.0241314|108.3753356 unknown
InChI: InChI=1S/C14H16N/c1-12(2)15-10-8-14(9-11-15)13-6-4-3-5-7-13/h3-12H,1-2H3
charge 1 multiplicity 1
31 atoms
N  2.448513 0.000062 -0.195686
C  3.978779 0.000036 -0.260069
C  4.538552 -1.289141 0.373664
C  4.538538 1.290356 0.371338
C  -0.377664 0.000044 -0.075039
C  1.711267 -0.001383 -1.355596
C  1.813166 0.001482 1.02363
C  0.310943 -0.001418 -1.31919
C  0.416512 0.001503 1.105928
C  -1.870486 0.00006 -0.009557
C  -2.580057 1.228837 0.022931
C  -2.580062 -1.228698 0.023553
C  -3.991325 1.223479 0.088132
C  -3.991328 -1.223301 0.088786
C  -4.698713 0.000098 0.121254
H  4.210872 -0.000933 -1.340353
H  4.365856 -1.325706 1.463862
H  5.629935 -1.316515 0.214862
H  4.106121 -2.19447 -0.085524
H  4.106022 2.19485 -0.089413
H  5.629905 1.317505 0.212379
H  4.365958 1.32884 1.461488
H  2.271695 -0.002472 -2.293093
H  2.447979 0.002574 1.910839
H  -0.245888 -0.00257 -2.259506
H  -0.058619 0.002649 2.09004
H  -2.038244 2.181061 -0.002394
H  -2.03825 -2.180936 -0.00126
H  -4.534854 2.173429 0.112916
H  -4.534857 -2.173237 0.114109
H  -5.792163 0.000114 0.171866
