program: Gaussian 09
title: 000186575
version: EM64L-G09RevD.01
frameworkgroup: C1[X(C18H16O2)]
method: RPBEPBE
basis: SDD
operation: Freq
keyword: #pfreq=noraman
keyword: PBEPBE/SDD
title: #p freq=noraman PBEPBE/SDD
converged: YES YES NO NO
title: Mulliken charges:
elementType: O O C C C C C C C C C C C C C C C C C C H H H H H H H H H H H H H H H H
charge: -0.458767 -0.462280 -0.067712 -0.293329 -0.435225 0.307545 -0.629924 0.406560 -0.648841 0.230318 -0.700524 0.459184 0.191240 -0.498799 0.424701 -0.479769 -0.365866 -0.433313 -0.262318 -0.249164 0.236593 0.214064 0.246790 0.226213 0.220910 0.234936 0.231579 0.255636 0.241176 0.352938 0.351358 0.234874 0.223606 0.239439 0.227179 0.228992
chargesum: 0.00000
title: Mulliken charges with hydrogens summed into heavy atoms:
elementType: O O C C C C C C C C C C C C C C C C C C
charge: -0.105829 -0.110921 0.168881 -0.079266 0.037779 0.307545 -0.174078 0.406560 -0.417262 0.230318 -0.444888 0.459184 0.191240 -0.257624 0.424701 -0.244895 -0.142260 -0.193874 -0.035139 -0.020172
polarizability: 3.36846404e+02 -6.24455018e+00 2.08911726e+02 1.04578923e+01 4.08802513e+00 9.66883114e+01
1716.lowfreq: -16.8022 -11.4939 -4.1725 -0.0003 0.0005 0.0006 36.1644 56.7489 64.8980
frequency: 35.8873 56.5972 64.8409 111.0275 139.6422 162.1608 202.1258 215.0083 260.9347 270.5556 291.3495 296.0747 336.3712 391.2090 410.3472 416.5777 428.0147 435.6276 468.4356 474.7924 484.6446 498.5742 525.5591 535.3889 556.2171 587.0974 632.3655 641.6960 699.8751 715.3090 747.2856 753.3572 757.9541 801.0442 804.5473 819.4239 835.0484 867.6804 884.2184 896.7618 911.2886 916.0098 943.2282 956.8052 962.2007 981.4107 991.1232 994.5610 1016.4703 1038.3288 1045.1973 1073.7855 1099.1738 1135.8046 1151.9467 1161.9851 1176.8204 1197.3974 1202.6856 1205.2062 1228.9292 1230.9399 1235.5087 1254.1877 1271.5938 1280.5493 1298.2250 1307.1697 1314.5026 1332.2503 1358.1774 1370.5405 1383.6700 1403.5969 1404.3435 1432.1807 1447.4017 1460.3570 1469.2690 1470.3523 1501.4487 1520.7545 1574.4761 1611.8824 1627.3706 1638.5717 2930.9218 2963.7765 2971.3458 3016.8118 3048.5120 3081.4966 3117.6418 3120.9153 3129.8488 3131.3959 3138.8960 3143.2221 3150.2117 3164.6590 3535.8543 3579.7171
redmass: 4.5301 4.3753 3.8801 4.0861 4.8419 5.0524 3.4094 5.9191 4.1463 3.5246 1.2058 2.5585 5.0533 3.5627 3.4983 3.8120 4.3015 3.1455 3.4503 3.6413 1.3438 4.6712 5.5805 3.4671 3.0416 3.2154 6.0037 4.8482 3.4359 5.9651 4.0372 2.9992 1.3772 2.3103 2.1921 3.0057 1.6932 4.1457 1.6408 1.9969 1.9339 1.8095 2.3651 1.4114 4.9604 1.3913 1.3886 3.2977 3.5383 2.1908 2.4601 2.3469 2.2822 1.9290 1.2868 1.3766 1.0865 1.5825 1.3257 1.3037 1.7283 1.9940 1.1684 1.5135 1.4710 2.1036 2.1688 1.3547 1.2940 1.3398 1.6521 1.5090 3.0229 4.1690 2.9396 3.1693 3.3327 1.2416 2.1310 1.1834 3.8128 4.0850 7.7784 6.0779 6.6767 7.2760 1.0814 1.0668 1.0854 1.0627 1.0929 1.1036 1.0861 1.0862 1.0905 1.0888 1.0913 1.0979 1.0927 1.0998 1.0649 1.0665
irintensity: 0.3217 0.1309 2.4545 0.1102 1.2693 3.0058 2.0976 1.5315 10.5084 4.3099 169.4822 14.1816 1.2655 2.0048 4.0858 2.3033 9.5853 7.6860 37.2065 28.0487 142.6437 1.4693 1.4748 1.0720 3.4626 4.9078 0.7418 5.3119 4.2276 0.7363 1.8983 0.4548 58.9423 3.5425 1.0538 3.1427 45.4088 4.0079 0.3002 18.9226 7.7203 33.0374 55.3614 10.1638 17.6135 1.4181 2.4863 101.7515 60.3394 14.5238 12.0864 8.2360 9.9249 3.5983 4.8634 0.4259 0.7673 16.4674 4.6711 6.4361 2.9707 8.3423 80.8569 25.3695 5.5852 1.9563 0.9241 5.4536 7.2170 4.2246 38.5256 8.1485 10.6716 0.8443 0.7931 3.0580 6.1850 7.8456 11.7283 17.4275 15.3738 3.4211 0.2999 2.8160 0.0444 1.9244 17.1460 33.8047 38.2400 29.5053 29.4118 23.7126 0.6629 3.6356 12.3408 2.4591 2.1333 31.9676 37.1907 35.9250 12.6342 14.3712
temp: 298.150 k
press: 1.00000 atm
elementType: 8 8 6 6 6 6 6 6 6 6 6 6 6 6 6 6 6 6 6 6 1 1 1 1 1 1 1 1 1 1 1 1 1 1 1 1
symmnumber: 1
zpe: 761581.8 jmol-1
zpe.correction: 0.290071 hartree
zpe.thermalcorrener: 0.305926 hartree
zpe.thermalcorrenthalpy: 0.306870 hartree
zpe.thermalcorrgfe: 0.247051 hartree
zpe.sumelectzpe: -844.585714 hartree
zpe.sumelectthermal: -844.569860 hartree
zpe.sumelectthermalent: -844.568915 hartree
zpe.sumelectthermalfe: -844.628734 hartree
dipole: 1.4722 0.5400 -1.2722
dipole: 2.0193
quadrupole: -119.4225 -101.8739 -120.2585
quadrupole: -5.3559 6.6105 -2.2113
quadrupole: -5.5709 11.9778 -6.4069 -5.3559 6.6105 -2.2113
hfenergy: -844.8757855 hartree
pointgroup: C01 [X(C18H16O2)]
dipole: 0.5941162 -0.1971192 0.489191 debye
polarizability: 336.0013165|7.3188718|209.1565857|-16.8462757|1.6184293|97.2885389 unknown
InChI: InChI=1S/C18H16O2/c19-17-8-7-13-9-15-12(10-16(13)18(17)20)6-5-11-3-1-2-4-14(11)15/h1-6,9-10,17-20H,7-8H2
charge 0 multiplicity 1
36 atoms
O  -5.662116 0.234225 -0.228809
O  -3.950148 -1.993166 0.293341
C  -4.223786 0.246218 -0.531148
C  -3.467535 -0.617608 0.505041
C  -3.748428 1.722279 -0.522897
C  -1.968761 -0.440131 0.350092
C  -2.567814 1.994883 0.458697
C  -1.503658 0.916763 0.348286
C  -0.134278 1.176261 0.216608
C  0.824191 0.123549 0.081545
C  -1.062478 -1.488708 0.191753
C  0.338499 -1.235423 0.061004
C  2.263831 0.36886 -0.048574
C  1.269736 -2.329516 -0.097846
C  3.157783 -0.754518 -0.202853
C  2.625546 -2.098761 -0.225306
C  2.833977 1.679848 -0.029071
C  4.563672 -0.529698 -0.332706
C  4.215534 1.878696 -0.157696
C  5.091909 0.766007 -0.311987
H  -4.043361 -0.222739 -1.521273
H  -3.784383 -0.270113 1.514707
H  -4.619232 2.342105 -0.245656
H  -3.442779 2.014694 -1.542465
H  -2.965686 2.022857 1.494675
H  -2.139426 2.993373 0.259557
H  0.195921 2.22035 0.20993
H  -1.422259 -2.522933 0.14234
H  0.873913 -3.351842 -0.116933
H  -5.937389 -0.719024 -0.18316
H  -3.716777 -2.552002 1.075843
H  3.32551 -2.933969 -0.346294
H  2.188054 2.555137 0.090399
H  5.226324 -1.395672 -0.449811
H  4.624057 2.895061 -0.138676
H  6.170636 0.927558 -0.412456
