program: Gaussian 09
title: 000184697
version: EM64L-G09RevD.01
frameworkgroup: C1[X(C10H13ClN2O4S)]
method: RPBEPBE
basis: SDD
operation: Freq
keyword: #p
keyword: freq=noraman
keyword: PBEPBE/SDD
title: #p freq=noraman PBEPBE/SDD
converged: YES YES NO NO
title: Mulliken charges:
elementType: Cl S O O O O N N C C C C C C C C C C H H H H H H H H H H H H H
charge: -0.039376 1.039316 -0.573213 -0.513263 -0.512529 -0.276848 -0.248089 -0.413779 -0.337479 -0.591136 -0.352411 0.313693 0.151569 -0.346156 -0.337656 -0.206172 -0.218875 -0.097300 0.233698 0.252778 0.288250 0.295322 0.223357 0.238424 0.292865 0.324185 0.281384 0.223513 0.382211 0.262808 0.260909
chargesum: 0.00000
title: Mulliken charges with hydrogens summed into heavy atoms:
elementType: Cl S O O O O N N C C C C C C C C C C
charge: -0.039376 1.039316 -0.191002 -0.513263 -0.512529 -0.276848 0.044776 -0.089594 0.148997 -0.007564 0.109371 0.313693 0.151569 -0.064773 -0.114143 0.056635 0.042034 -0.097300
polarizability: 2.80484063e+02 2.62067642e+00 1.51754052e+02 -1.66007839e+01 5.68803269e+00 1.09693470e+02
1716.lowfreq: -12.1726 -4.2969 -0.0002 0.0005 0.0020 3.0112 11.6435 15.9734 20.0654
frequency: 11.6214 14.3037 20.0073 28.9424 44.7836 73.3344 84.7441 97.7399 106.8576 117.3843 174.6759 180.8182 189.7074 235.9519 243.3685 260.3309 278.7152 299.3397 301.4216 317.3725 362.7739 381.0986 406.1076 423.8968 457.7518 504.3941 526.1317 533.6916 564.3065 601.1402 622.7927 680.2069 710.5129 722.4065 742.5764 777.9692 824.0414 845.3273 848.8791 852.6862 861.4813 950.4801 951.1965 985.2914 998.8278 1012.7793 1029.8220 1047.8179 1056.4492 1073.5913 1074.3693 1094.2265 1111.8071 1148.4802 1186.8548 1200.7200 1247.6012 1256.0786 1280.2265 1292.6213 1298.0156 1322.5052 1367.8680 1372.5567 1393.1905 1416.6939 1434.9844 1478.8723 1480.4872 1492.9319 1498.4397 1563.0249 1597.0870 1598.3041 2962.7280 3000.6423 3043.4880 3058.7184 3071.8226 3132.3586 3149.8974 3158.7013 3174.0316 3178.7635 3386.9492 3501.3442 3566.5761
redmass: 8.9230 6.1398 10.1385 3.8391 6.4215 6.9788 3.2186 2.6389 6.1038 4.0985 2.0232 3.9415 5.8483 2.1729 5.4316 6.5429 5.4924 5.0222 6.6201 8.4750 5.6524 6.8533 2.8526 5.9653 3.5802 5.4367 1.7526 2.7830 7.9707 5.4192 6.9618 4.1362 7.1179 1.6214 3.3439 1.1074 1.4080 10.5891 2.1659 1.4815 2.5068 1.4120 3.8790 1.3706 4.2991 2.6594 1.3666 5.3502 2.9936 2.1650 2.5479 1.7599 1.3633 2.3494 1.1347 2.1036 1.2161 1.3549 1.8543 1.0971 1.3862 1.2653 4.5260 1.4027 4.0393 1.1088 1.6650 2.2073 1.1048 1.0893 1.1793 6.8013 6.2409 7.3105 1.0648 1.0607 1.0966 1.0562 1.1041 1.0898 1.1107 1.0889 1.0953 1.0973 1.0739 1.0665 1.0791
irintensity: 1.5800 0.6922 0.3182 0.7307 4.7415 0.8475 1.9490 0.1634 5.5936 3.6715 30.7400 14.3656 5.5126 41.8219 8.8948 25.5437 14.9835 58.6705 20.0591 13.5791 1.5925 25.6463 0.5934 11.4061 7.9999 13.3579 172.1643 21.2981 97.4228 9.2293 1.3404 5.7808 9.6051 69.0738 28.7166 4.3844 18.1718 51.0949 3.6873 41.8206 12.3255 4.2712 79.7993 2.5552 51.1461 17.2733 43.0498 7.0109 22.8858 16.9516 68.1936 17.2204 13.1980 3.1167 5.4595 4.3076 4.1370 20.8374 103.3822 4.7190 26.3564 31.6526 1.8182 10.6164 3.5779 6.8612 244.7195 18.5721 3.1336 6.8228 33.8407 45.1593 103.2534 49.5466 29.0175 8.0586 10.8339 4.4712 17.4923 12.5958 0.5724 0.0738 3.1820 1.7428 1.7013 53.7353 24.7104
temp: 298.150 k
press: 1.00000 atm
elementType: 17 16 8 8 8 8 7 7 6 6 6 6 6 6 6 6 6 6 1 1 1 1 1 1 1 1 1 1 1 1 1
symmnumber: 1
zpe: 592341.8 jmol-1
zpe.correction: 0.225611 hartree
zpe.thermalcorrener: 0.245619 hartree
zpe.thermalcorrenthalpy: 0.246563 hartree
zpe.thermalcorrgfe: 0.171518 hartree
zpe.sumelectzpe: -1655.826545 hartree
zpe.sumelectthermal: -1655.806537 hartree
zpe.sumelectthermalent: -1655.805593 hartree
zpe.sumelectthermalfe: -1655.880638 hartree
dipole: 2.8536 -0.6237 -2.6831
dipole: 3.9662
quadrupole: -145.5037 -118.9907 -127.4352
quadrupole: -14.3249 8.9552 -2.9758
quadrupole: -14.8605 11.6525 3.2080 -14.3249 8.9552 -2.9758
hfenergy: -1656.0521563 hartree
pointgroup: C01 [X(C10H13Cl1N2O4S1)]
dipole: -1.1091509 1.0916507 0.114127 debye
polarizability: 279.6104513|-19.1655378|111.7079583|7.7792058|9.0057164|150.6131746 unknown
InChI: InChI=1S/C10H13ClN2O4S/c11-9-4-2-8(3-5-9)10(14)13-12-6-1-7-18(15,16)17/h2-5,12-13,15H,1,6-7H2
charge 0 multiplicity 1
31 atoms
Cl -7.281094 0.572816 -0.360084
S  5.925703 -0.150488 0.118216
O  6.614462 0.824792 -1.315313
O  6.131787 -1.734351 -0.135864
O  6.4241 0.501924 1.512339
O  -0.782279 -1.54761 -0.968477
N  0.791859 -0.776852 1.215179
N  -0.580213 -0.428374 1.050018
C  3.153447 -0.411248 0.615638
C  4.115083 0.369075 -0.279244
C  1.698985 0.02809 0.335371
C  -2.784805 -0.500477 -0.054472
C  -1.326823 -0.867583 -0.040427
C  -3.454978 -0.561644 -1.303322
C  -3.515435 -0.127506 1.104727
C  -4.821327 -0.233296 -1.407537
C  -4.885511 0.200148 1.017182
C  -5.515724 0.148822 -0.241751
H  3.261745 -1.495522 0.417742
H  3.380077 -0.23845 1.683663
H  4.130542 1.455642 -0.100637
H  4.024787 0.141172 -1.352696
H  1.563853 1.091956 0.601115
H  1.448423 -0.100127 -0.738989
H  0.889286 -1.782643 0.99414
H  -0.979463 0.135394 1.799916
H  -2.886107 -0.878518 -2.1830
H  -3.047295 -0.123249 2.095723
H  7.610615 0.741017 -1.299053
H  -5.337133 -0.275596 -2.370896
H  -5.453474 0.478685 1.90909
