program: Gaussian 09
title: 000015710
version: EM64L-G09RevD.01
frameworkgroup: C1[X(C7H10S)]
method: RPBEPBE
basis: SDD
operation: Freq
keyword: #pfreq=noraman
keyword: PBEPBE/SDD
title: #p freq=noraman PBEPBE/SDD
converged: YES YES NO NO
title: Mulliken charges:
elementType: S C C C C C C C H H H H H H H H H H
charge: 0.228184 0.331898 0.455571 -0.281030 -0.734404 -0.781714 -0.791705 -0.750740 0.269209 0.227560 0.218691 0.227606 0.224395 0.224766 0.227203 0.224945 0.239807 0.239757
chargesum: 0.00000
title: Mulliken charges with hydrogens summed into heavy atoms:
elementType: S C C C C C C C
charge: 0.228184 0.331898 0.455571 -0.281030 -0.465195 -0.107857 -0.115341 -0.046231
polarizability: 1.10630702e+02 1.69600893e+00 1.00573307e+02 1.35457572e-02 6.43109281e-03 5.06079093e+01
1716.lowfreq: -4.4352 -0.0010 0.0023 0.0024 2.0966 8.3562 47.4895 95.2527 137.5958
frequency: 47.0081 95.1862 137.5720 159.1210 251.7672 258.7772 269.2939 298.1995 391.5424 476.2107 501.6803 535.5778 602.3533 651.9310 735.8279 767.3156 804.7155 933.2466 996.0520 1025.5504 1040.6083 1050.0138 1088.5916 1093.0862 1169.6889 1212.9730 1387.9155 1393.0290 1401.5756 1409.6308 1461.2001 1461.5838 1465.2023 1472.0919 1474.3766 1475.4810 1530.8493 1602.9878 2969.8977 2971.5438 2976.0952 3042.6351 3043.7965 3049.5940 3084.9733 3086.3002 3090.4060 3223.8836
redmass: 1.0287 1.0928 2.1195 1.1144 3.6318 2.5717 3.1717 2.5962 3.4884 3.8563 6.4666 5.6952 4.0532 3.6299 1.2318 3.3397 3.8940 1.8015 1.4280 1.3699 1.4220 1.5741 1.8546 2.3459 1.5521 3.7711 2.7245 1.3615 1.3673 1.2863 1.1118 1.0452 1.0450 1.0836 1.0448 1.1983 3.6105 5.9474 1.0377 1.0381 1.0371 1.0978 1.0976 1.0983 1.0979 1.0972 1.0955 1.0960
irintensity: 0.7087 0.0006 1.5291 0.0557 5.3076 1.3223 6.7519 0.2513 0.7723 0.1462 0.6558 2.0136 5.4906 0.6842 49.6700 1.5806 8.4944 3.0175 11.7627 10.4073 0.3409 0.9828 9.0103 16.4920 1.3448 3.2101 1.3636 1.3028 17.5975 6.6072 24.0161 6.4736 1.3108 15.5175 33.8879 1.3859 3.1970 3.6123 26.5361 56.8744 36.8363 27.3065 18.8071 23.2564 21.0231 29.9036 17.0371 0.6713
temp: 298.150 k
press: 1.00000 atm
elementType: 16 6 6 6 6 6 6 6 1 1 1 1 1 1 1 1 1 1
symmnumber: 1
zpe: 386806.2 jmol-1
zpe.correction: 0.147327 hartree
zpe.thermalcorrener: 0.156754 hartree
zpe.thermalcorrenthalpy: 0.157698 hartree
zpe.thermalcorrgfe: 0.112624 hartree
zpe.sumelectzpe: -670.187278 hartree
zpe.sumelectthermal: -670.177851 hartree
zpe.sumelectthermalent: -670.176907 hartree
zpe.sumelectthermalfe: -670.221981 hartree
dipole: 0.7793 1.4036 -0.0015
dipole: 1.6054
quadrupole: -51.5524 -52.9188 -59.1439
quadrupole: -2.7936 0.0033 -0.0002
quadrupole: 2.9860 1.6196 -4.6055 -2.7936 0.0033 -0.0002
hfenergy: -670.334605 hartree
pointgroup: C01 [X(C7H10S1)]
dipole: -0.1518441 -0.6118924 0.0384623 debye
dipolederiv: -0.2724853 -0.1496737 0.0198153 -0.0685581 -0.3372641 0.0263167 0.0153893 0.029174 0.0914447 -0.2645885 -0.099192 0.0123688 0.008135 0.0848891 -0.0077447 0.0068143 -0.0044455 -0.0480938 0.2113971 0.0690115 -0.0111677 -0.094579 -0.1051288 0.0075719 -0.0028194 0.002059 -0.020718 0.1640346 -0.0467101 -0.0101778 0.0152568 0.4377089 -0.0383929 -0.0149627 -0.0366239 -0.234345 0.1794537 0.2348044 -0.0300697 0.1981251 -0.0862782 -0.0216214 -0.0279087 -0.0226708 -0.3605637 0.0490658 -0.0496841 0.0043216 -0.015448 -0.0475755 0.0087215 0.0025444 0.0096794 0.1014702 -0.0264869 -0.0387844 0.0057748 -0.0746999 0.0381993 0.0051394 0.0083009 0.0047957 0.0919843 -0.0448097 0.03849 0.0030784 0.036926 -0.0184758 0.0068653 0.0041002 0.0066858 0.1245493 -0.0066814 0.0726414 0.0027643 0.0342922 0.034991 0.0090652 0.0048714 0.0079125 0.2159903 0.0319838 -0.0909201 -0.1080308 -0.0550137 -0.0104331 -0.0331061 -0.1029599 -0.0903153 -0.0372821 -0.0995586 0.1614357 -0.002454 0.0632537 0.0367498 0.0017544 0.0029402 -0.0012962 0.1037356 0.0458521 -0.0726847 0.1113149 -0.0415673 0.0030014 0.031133 0.1024803 0.0904662 -0.0646642 0.0261835 -0.0479535 0.0015113 -0.0922482 -0.0101293 -0.1199695 -0.0586665 -0.1224625 -0.0348253 0.0287361 -0.0416463 0.0000719 -0.0780278 0.0198073 0.1176674 0.0650968 0.1178813 -0.0681123 -0.0340403 0.0638458 0.0000651 0.1692823 -0.0430079 0.0050994 -0.0062677 0.0077137 0.1128341 0.0821586 0.0000381 0.0010766 0.0719837 -0.1422263 0.0127761 -0.0031864 0.0148664 0.1088997 -0.0286499 0.0046333 0.0762691 -0.0280324 0.0797724 0.0690831 0.1332632 0.0393547 -0.0552751 -0.0415647 -0.0076513 -0.0765322 -0.0490804 0.0653999 -0.0803589 -0.1290298 -0.0527746 -0.0270289 unknown
polarizability: 109.0347035|3.8880232|101.9359359|-2.040986|-3.0128233|50.841279 unknown
InChI: InChI=1S/C7H10S/c1-5-4-8-7(3)6(5)2/h4H,1-3H3
charge 0 multiplicity 1
18 atoms
S  0.907262 1.84941 -0.160391
C  0.016143 -0.645526 0.007953
C  -1.168967 0.21207 -0.004062
C  1.212075 0.060107 -0.06862
C  -0.862069 1.557605 -0.089078
C  -0.09782 -2.152661 0.095713
C  -2.580601 -0.326911 0.069469
C  2.63667 -0.425878 -0.086833
H  -1.54123 2.408167 -0.115838
H  -0.678725 -2.559284 -0.754467
H  0.8876 -2.647077 0.091494
H  -0.621668 -2.460454 1.02117
H  -2.795665 -1.011539 -0.773495
H  -2.746159 -0.899704 1.002242
H  -3.322921 0.488643 0.038758
H  2.673942 -1.526732 -0.02243
H  3.159737 -0.128887 -1.015455
H  3.218797 -0.022847 0.763271
