program: Gaussian 09
title: 000186576
version: EM64L-G09RevD.01
frameworkgroup: C1[X(C19H16O2)]
method: RPBEPBE
basis: SDD
operation: Freq
keyword: #pfreq=noraman
keyword: PBEPBE/SDD
title: #p freq=noraman PBEPBE/SDD
converged: YES YES NO NO
title: Mulliken charges:
elementType: O O C C C C C C C C C C C C C C C C C C C H H H H H H H H H H H H H H H H
charge: -0.427791 -0.433164 0.328383 -0.343699 0.254173 -0.186746 0.293343 0.246114 0.451507 -0.697968 -0.599978 -0.441075 0.190932 0.421596 -0.491448 -0.829781 -0.479125 -0.372279 -0.433270 -0.261263 -0.248228 0.272911 0.259192 0.252062 0.239058 0.242485 0.245702 0.235305 0.231723 0.238138 0.237692 0.339864 0.222887 0.341323 0.241554 0.228797 0.231073
chargesum: 0.00000
title: Mulliken charges with hydrogens summed into heavy atoms:
elementType: O O C C C C C C C C C C C C C C C C C C C
charge: -0.087927 -0.091840 0.328383 -0.070788 0.254173 0.072446 0.293343 0.246114 0.451507 -0.445907 -0.360920 -0.198590 0.190932 0.421596 -0.245746 -0.124615 -0.241433 -0.149392 -0.191716 -0.032466 -0.017155
polarizability: 3.81172656e+02 5.11195470e+00 2.22837978e+02 2.67545575e+00 -5.07044498e+00 1.06810545e+02
1716.lowfreq: -0.0007 -0.0006 -0.0002 3.4509 9.7898 14.3306 41.3252 49.6240 76.5455
frequency: 41.2933 49.5816 76.5421 119.7913 131.5277 145.4986 156.3886 191.1661 214.6265 231.4212 252.7037 270.7182 284.7160 307.7906 332.5357 357.9812 392.1002 394.8338 413.9498 437.6842 452.6995 483.4072 496.7812 514.8647 527.5814 535.4073 548.2368 589.5191 598.1512 639.0164 689.2777 704.7073 720.3702 753.3043 758.9054 763.5014 802.5218 806.2289 833.7890 837.8423 873.9355 886.0942 887.3565 907.5486 917.2444 931.6104 937.6904 952.1098 958.9810 984.5972 993.7761 1015.2642 1038.4789 1044.4241 1054.3978 1103.0377 1120.8923 1157.9412 1174.5898 1178.6536 1193.4732 1209.0457 1218.7860 1231.7003 1239.8751 1266.9846 1272.5144 1286.0260 1299.7593 1330.6514 1346.4947 1355.7646 1372.1104 1382.7878 1397.5634 1404.7469 1408.2530 1429.1208 1447.5609 1468.0373 1470.3090 1476.2871 1504.5116 1512.3723 1569.2336 1610.5686 1624.2433 1629.3062 1634.9581 2972.0563 3047.1883 3070.6296 3075.6542 3091.7617 3120.7655 3123.3238 3123.7155 3133.7911 3134.5080 3145.7835 3148.8731 3160.4172 3167.0323 3536.7425 3539.9840
redmass: 5.2619 4.8496 4.5572 4.3950 4.9802 3.8175 4.5846 3.1974 1.1806 3.8343 3.6217 3.5340 1.2726 1.1619 4.2903 4.6457 4.5946 3.2495 4.0890 3.1054 4.5366 4.5623 5.0868 4.3299 5.5974 3.3704 3.2717 3.6096 4.9405 6.0199 5.0741 3.8569 5.7210 4.2226 1.3351 4.1607 2.3788 2.5599 1.4502 1.7044 4.3123 1.7834 2.8575 1.7779 2.4139 3.6257 2.5433 3.9371 1.4099 1.3829 1.3782 2.6958 2.0650 1.5463 2.3712 2.3050 2.0349 1.3290 1.2892 1.0868 1.2136 1.8612 1.3878 1.9429 1.9168 2.6046 2.2378 1.4828 1.8735 1.5176 1.3493 1.2364 1.7615 3.9886 1.2408 3.4004 3.2194 3.0318 3.6293 1.0623 2.7459 1.1426 3.9051 3.8675 6.8839 6.0318 6.5297 7.0305 6.8446 1.0382 1.0967 1.0856 1.0870 1.0981 1.0873 1.0871 1.0900 1.0882 1.0922 1.0983 1.0941 1.0917 1.0972 1.0661 1.0663
irintensity: 0.3872 0.6196 0.3643 1.7259 0.7885 1.5563 1.7273 3.5583 0.7463 0.1332 0.6444 3.4970 68.0617 104.4445 27.5073 14.9641 6.7699 3.4012 2.1878 16.9956 2.9711 2.7226 4.8475 3.5360 1.6498 0.5481 2.3146 2.2892 0.3528 6.8437 0.9886 8.6218 1.4781 6.2130 53.9566 6.2597 8.0451 7.6359 30.1956 41.1299 3.6644 5.9386 21.8133 41.2385 84.2056 69.0665 11.1991 17.3529 7.0679 0.0554 0.1304 6.3367 2.2595 4.9311 13.1706 4.1973 12.4775 2.8651 30.7539 1.9166 52.3376 0.4905 31.5126 3.8967 19.8574 6.4407 2.8497 7.2940 0.5990 4.1925 25.6372 62.6892 23.3244 8.7945 17.4706 3.9501 2.4116 1.5671 1.3580 15.4733 7.2549 12.2642 4.3729 13.4139 1.3843 4.3006 0.1880 0.6466 6.6932 19.8611 17.2499 14.3848 20.0864 25.7150 0.2539 5.5622 7.5776 3.4077 17.3971 25.8521 28.3764 14.9994 33.9043 10.3682 12.3709
temp: 298.150 k
press: 1.00000 atm
elementType: 8 8 6 6 6 6 6 6 6 6 6 6 6 6 6 6 6 6 6 6 6 1 1 1 1 1 1 1 1 1 1 1 1 1 1 1 1
symmnumber: 1
zpe: 772565.5 jmol-1
zpe.correction: 0.294255 hartree
zpe.thermalcorrener: 0.311477 hartree
zpe.thermalcorrenthalpy: 0.312421 hartree
zpe.thermalcorrgfe: 0.250015 hartree
zpe.sumelectzpe: -882.624530 hartree
zpe.sumelectthermal: -882.607308 hartree
zpe.sumelectthermalent: -882.606364 hartree
zpe.sumelectthermalfe: -882.668770 hartree
dipole: 3.2185 2.6476 -0.1726
dipole: 4.1711
quadrupole: -124.9155 -109.1052 -130.1895
quadrupole: -10.6323 3.8840 -3.5493
quadrupole: -3.5121 12.2982 -8.7861 -10.6323 3.8840 -3.5493
hfenergy: -882.918785 hartree
pointgroup: C01 [X(C19H16O2)]
dipole: 1.2841276 -1.0209705 0.0408535 debye
polarizability: 381.2267451|-2.4249479|222.8357367|-5.2031277|-3.3858488|106.7586972 unknown
InChI: InChI=1S/C19H16O2/c1-11-8-18(20)19(21)17-9-13-7-6-12-4-2-3-5-14(12)16(13)10-15(11)17/h2-10,18-21H,1H3
charge 0 multiplicity 1
37 atoms
O  -3.700501 1.243658 1.762049
O  -4.463984 0.279744 -1.784795
C  -1.904667 0.734858 0.142422
C  -3.371482 1.0880 0.318228
C  -1.510946 -0.653007 0.126127
C  -4.318511 0.047186 -0.320286
C  -2.558165 -1.710338 0.147183
C  0.876195 0.031475 0.024735
C  0.465592 1.414168 0.013969
C  -0.926957 1.728038 0.074569
C  -0.138911 -0.968717 0.080158
C  -3.874889 -1.373717 -0.048076
C  2.306542 -0.288248 -0.025737
C  3.264934 0.790061 -0.087711
C  1.457572 2.461654 -0.049527
C  -2.146064 -3.15882 0.332408
C  2.805496 2.160939 -0.098692
C  2.805675 -1.627516 -0.015455
C  4.662893 0.494784 -0.137259
C  4.180606 -1.89572 -0.064404
C  5.121001 -0.827347 -0.12622
H  -3.601486 2.078525 -0.105949
H  -5.332517 0.235132 0.068602
H  -1.230838 2.782077 0.089647
H  0.153294 -2.022104 0.074429
H  -4.64188 -2.156148 -0.079634
H  1.11716 3.503561 -0.055618
H  -1.565747 -3.299017 1.264002
H  -1.509221 -3.509287 -0.502894
H  -3.030201 -3.815968 0.377179
H  3.553922 2.960658 -0.145812
H  -3.42224 0.415826 2.234403
H  2.110407 -2.471175 0.032855
H  -3.650571 -0.068181 -2.234746
H  5.375389 1.327007 -0.183994
H  4.534601 -2.932383 -0.05462
H  6.194098 -1.043255 -0.164334
