program: Gaussian 09
title: 000184689
version: EM64L-G09RevD.01
frameworkgroup: C1[X(C14H18O4)]
method: RPBEPBE
basis: SDD
operation: Freq
keyword: #pfreq=noraman
keyword: PBEPBE/SDD
title: #p freq=noraman PBEPBE/SDD
converged: YES YES NO NO
title: Mulliken charges:
elementType: O O O O C C C C C C C C C C C C C C H H H H H H H H H H H H H H H H H H
charge: -0.255856 -0.236170 -0.434686 -0.234204 -0.012835 -0.415901 -0.377533 -0.727861 -0.321562 -0.706515 0.157136 0.214029 0.156259 -0.373260 -0.321110 -0.217967 -0.218149 0.106772 0.197494 0.230254 0.217952 0.198335 0.197159 0.210751 0.210304 0.223119 0.245550 0.235839 0.216112 0.220842 0.211574 0.266543 0.274903 0.239617 0.238926 0.384139
chargesum: 0.00000
title: Mulliken charges with hydrogens summed into heavy atoms:
elementType: O O O O C C C C C C C C C C C C C C
charge: -0.255856 -0.236170 -0.050547 -0.234204 0.184659 0.032305 0.017962 -0.083687 0.159827 -0.057988 0.157136 0.214029 0.156259 -0.106717 -0.046207 0.021650 0.020777 0.106772
polarizability: 2.02211171e+02 -6.97787345e+00 1.70105205e+02 2.65275598e+01 -3.99969121e+00 1.20655880e+02
1716.lowfreq: -39.9231 -5.2969 -0.0008 -0.0007 0.0003 2.8690 10.6584 18.4708 31.5136
frequency: -33.6388 17.7688 31.4527 38.8384 56.2902 76.4269 107.0235 125.5330 131.8753 152.2123 180.1459 205.2804 225.6747 229.0398 246.8211 278.5816 297.5364 343.4854 353.0444 383.3284 401.0723 412.0305 434.8584 507.5891 529.6146 567.2231 592.6355 599.8484 652.0545 678.2413 706.1665 730.0777 757.5696 767.5376 777.3269 790.7170 791.8279 812.0539 897.2317 909.5706 909.7896 956.9006 976.6752 981.0669 997.8325 1000.3191 1005.7440 1024.3688 1034.7183 1050.4392 1070.4775 1111.0082 1132.3418 1147.7405 1162.8359 1178.1622 1182.5962 1231.3887 1239.3726 1247.1533 1279.8470 1280.7881 1299.5427 1303.6038 1313.8745 1343.1514 1346.0003 1376.4754 1382.4014 1388.4834 1390.0869 1429.7389 1454.2983 1470.0567 1472.9271 1475.7504 1478.3510 1479.3111 1485.4613 1488.9419 1579.4373 1603.6991 1619.5513 1646.7905 2952.6516 2968.1562 2973.4047 2974.6000 2997.8520 3014.8014 3035.1491 3048.9904 3065.7177 3069.1339 3071.3435 3072.7491 3111.6290 3139.0133 3153.8036 3168.1294 3181.4059 3525.7937
redmass: 3.4367 4.5775 4.6582 5.5072 3.9309 5.9131 5.1732 2.4850 2.4577 5.2256 2.7096 1.1453 1.7781 2.4262 2.1950 4.5355 4.8344 2.4932 7.8461 5.6169 3.6849 3.4267 2.7373 3.2189 4.8382 3.4275 1.7133 2.4684 5.2942 4.9131 3.7567 3.4563 1.8592 1.5441 2.9362 1.6734 2.5617 1.9201 2.2170 2.1447 2.3087 1.2426 1.4201 1.5012 2.0106 3.9246 1.3895 1.7425 3.0909 3.0322 3.4775 1.8346 1.9899 2.1182 1.7512 1.0686 2.0933 1.2204 2.7758 1.3099 1.4922 1.3436 1.1850 1.3088 2.5454 1.3826 1.4990 1.4157 8.3866 1.2175 1.2136 2.2121 1.1039 1.0819 1.0709 1.0622 2.3828 1.0660 1.0699 1.0630 7.1603 6.3259 10.4199 8.9619 1.0812 1.0588 1.0358 1.0387 1.0616 1.0995 1.0581 1.1019 1.0993 1.0992 1.0994 1.0995 1.1087 1.0864 1.0912 1.0967 1.0978 1.0641
irintensity: 0.1288 0.2305 1.6666 0.2288 0.3402 1.2475 1.7263 0.1069 0.3911 2.0139 1.2710 0.0694 0.1450 0.2724 0.1546 6.6688 5.9335 0.9381 7.0571 13.5855 3.6257 4.1514 0.5067 11.5544 10.9693 14.1744 67.1559 56.4902 8.0506 8.0844 108.6357 4.7555 9.4521 2.6321 22.0372 27.2882 6.5406 0.5087 15.6945 5.4280 7.3725 4.5953 13.0129 6.1108 11.3620 220.7538 7.7499 0.7602 84.2537 0.9082 182.4532 72.3849 2.1070 12.8507 70.1851 0.1850 7.0987 1.1541 218.5311 1.6624 29.4900 34.6646 5.1307 13.8461 76.1800 0.2226 3.6635 0.3969 10.3645 7.2859 24.3986 7.0417 5.1320 4.2218 5.2484 26.3638 12.7514 5.5819 21.7779 7.2235 26.6759 20.0866 148.5091 230.6544 16.2300 29.1625 56.8443 10.8466 20.2516 32.9693 25.5897 18.2075 7.5456 103.0134 30.6765 80.9333 16.1265 2.0754 9.1574 11.2841 10.1788 40.6818
temp: 298.150 k
press: 1.00000 atm
elementType: 8 8 8 8 6 6 6 6 6 6 6 6 6 6 6 6 6 6 1 1 1 1 1 1 1 1 1 1 1 1 1 1 1 1 1 1
symmnumber: 1
zpe: 767700.1 jmol-1
zpe.correction: 0.292402 hartree
zpe.thermalcorrener: 0.310422 hartree
zpe.thermalcorrenthalpy: 0.311366 hartree
zpe.thermalcorrgfe: 0.244325 hartree
zpe.sumelectzpe: -843.838111 hartree
zpe.sumelectthermal: -843.820091 hartree
zpe.sumelectthermalent: -843.819147 hartree
zpe.sumelectthermalfe: -843.886187 hartree
dipole: 0.8282 0.8095 2.4797
dipole: 2.7368
quadrupole: -85.7742 -97.9344 -114.9591
quadrupole: -1.5993 3.6311 -6.4997
quadrupole: 13.7817 1.6215 -15.4032 -1.5993 3.6311 -6.4997
hfenergy: -844.1305128 hartree
pointgroup: C01 [X(C14H18O4)]
dipole: -0.3576956 -0.5581155 0.8484794 debye
polarizability: 204.3199721|-0.4281143|164.9306122|-24.316832|15.5078382|123.7216712 unknown
InChI: InChI=1S/C14H18O4/c1-3-10(2)8-9-18-14(17)12-7-5-4-6-11(12)13(15)16/h4-7,10,15H,3,8-9H2,1-2H3
charge 0 multiplicity 1
36 atoms
O  0.515691 -0.075188 0.001905
O  0.176923 2.048175 -0.913628
O  -2.487539 -2.71082 -0.940405
O  -1.025237 -1.302667 -2.062646
C  4.322849 0.631965 0.445249
C  2.785135 0.678073 0.688424
C  4.910841 -0.807952 0.430327
C  4.729978 1.3996 -0.837503
C  1.95816 -0.031038 -0.394212
C  4.639201 -1.629683 1.709497
C  -0.269347 1.000532 -0.387646
C  -1.70671 0.790569 0.001848
C  -2.43439 -0.406613 -0.262606
C  -2.336127 1.845407 0.703718
C  -3.75618 -0.543485 0.232917
C  -3.657349 1.706041 1.181341
C  -4.36351 0.502199 0.95857
C  -1.882037 -1.46121 -1.163432
H  4.781017 1.159048 1.310049
H  2.463695 1.735472 0.739067
H  2.547689 0.218647 1.666649
H  6.006516 -0.724374 0.281239
H  4.528957 -1.358373 -0.453896
H  5.830127 1.485316 -0.909958
H  4.378554 0.882933 -1.750533
H  4.306327 2.420733 -0.84588
H  2.032152 0.477369 -1.370406
H  2.223611 -1.094988 -0.496452
H  5.163059 -2.602571 1.673048
H  3.562196 -1.838372 1.845245
H  4.992531 -1.090916 2.609306
H  -1.774553 2.768767 0.877139
H  -4.300584 -1.46853 0.025543
H  -4.12886 2.52958 1.727871
H  -5.385543 0.384134 1.333323
H  -2.117644 -3.361176 -1.596272
