program: Gaussian 09
title: 000186554
version: EM64L-G09RevD.01
frameworkgroup: C1[X(C20H16O)]
method: RPBEPBE
basis: SDD
operation: Freq
keyword: #pfreq=noraman
keyword: PBEPBE/SDD
title: #p freq=noraman PBEPBE/SDD
converged: YES YES NO YES
title: Mulliken charges:
elementType: O C C C C C C C C C C C C C C C C C C C C H H H H H H H H H H H H H H H H
charge: -0.447001 0.020223 0.325361 -0.537801 -0.103824 -0.594329 -0.435808 0.291979 0.003870 0.502836 -0.735028 -0.004863 -0.449616 0.494983 0.477623 -0.501738 -0.510398 -0.485298 -0.470417 -0.466205 -0.244893 0.231472 0.238678 0.229943 0.250043 0.223814 0.206117 0.230699 0.245545 0.244808 0.241510 0.235175 0.237087 0.344576 0.242959 0.241079 0.226836
chargesum: 0.00000
title: Mulliken charges with hydrogens summed into heavy atoms:
elementType: O C C C C C C C C C C C C C C C C C C C C
charge: -0.102425 0.020223 0.325361 -0.067651 0.126119 -0.120471 0.001007 0.291979 0.003870 0.502836 -0.489483 -0.004863 -0.204808 0.494983 0.477623 -0.260228 -0.275223 -0.248210 -0.227457 -0.225126 -0.018057
polarizability: 3.69968884e+02 -1.20406280e+01 2.36234339e+02 1.39298976e+01 -1.68609798e+00 1.03404484e+02
1716.lowfreq: -8.6601 -0.0004 0.0001 0.0005 3.8111 13.7880 45.2617 65.5017 91.1020
frequency: 45.2483 65.4536 91.0987 158.2927 178.6050 191.5910 202.1871 222.3432 289.4571 307.1141 334.8819 345.7723 362.5974 375.0598 377.4316 416.9218 456.7294 474.5399 503.8262 509.0939 512.3849 524.3414 547.8664 555.7712 565.6850 599.5548 623.8651 675.4850 698.2222 725.6004 741.2889 747.6098 768.7498 792.3596 810.7993 822.7635 833.7851 845.0887 864.6148 869.6612 895.0601 910.6636 919.7928 945.7441 967.3957 974.9123 984.4823 989.7422 996.7704 1001.8901 1053.2069 1078.4888 1099.0301 1117.4831 1125.1769 1157.9494 1166.8841 1171.5684 1181.9970 1193.7566 1209.6981 1219.8068 1236.8224 1257.0391 1267.6296 1282.1508 1303.5403 1318.1538 1329.9275 1345.7704 1354.8888 1372.6585 1378.2042 1387.1844 1413.2847 1427.5379 1432.2513 1434.4142 1445.9873 1455.8536 1463.2809 1469.8147 1492.5152 1498.1535 1557.7203 1591.5848 1606.8195 1608.4979 1636.4352 2960.9706 2970.7834 2987.4320 3019.7165 3036.7543 3056.5955 3061.4506 3111.9705 3118.7376 3122.2349 3124.2502 3131.8223 3143.5320 3156.5178 3159.5217 3543.0214
redmass: 4.9964 3.9648 4.7211 3.9540 4.0920 4.2090 2.8809 3.8462 3.2578 4.5799 2.4912 1.4802 1.9879 4.6007 3.0151 3.3048 4.2899 6.6193 4.6146 5.4392 3.8284 3.8029 2.9900 5.5958 4.4584 5.9832 3.6053 5.2483 3.7026 2.2417 2.7115 4.7511 1.2539 5.1174 4.4236 1.4054 3.0371 2.6089 2.4453 2.3362 2.4074 1.6395 1.6666 2.6181 2.7748 1.3504 1.4388 1.4189 3.3315 3.5346 2.2280 1.9901 1.6901 2.3275 1.9918 1.1245 1.2571 1.2305 1.3729 1.2519 1.5063 1.7172 1.7055 1.8081 1.4960 2.0222 1.7236 1.7876 2.7964 1.5267 1.9112 1.6598 1.5419 3.1739 2.6241 4.5391 3.6059 1.9375 1.4121 1.0863 2.1542 1.8495 5.5262 3.0710 4.9443 7.2816 6.4272 6.7422 7.4958 1.0647 1.0640 1.0650 1.0925 1.0964 1.0930 1.0954 1.0910 1.0862 1.0863 1.0878 1.0917 1.0983 1.0989 1.0950 1.0657
irintensity: 0.2689 0.9237 2.1499 1.0839 2.9395 1.8257 7.4172 5.8531 3.7908 4.3963 15.7867 46.9438 12.3644 1.1621 9.9030 1.0182 0.5878 0.4050 2.5285 3.1930 1.3781 0.0393 1.4833 0.5110 2.1488 1.2155 0.4189 0.9972 2.5004 11.8905 25.3529 7.2638 10.8496 8.1563 6.7890 0.1780 34.4695 3.3886 20.8680 45.1361 23.3892 7.4955 6.3088 30.1558 10.5878 0.0617 4.0095 2.9021 4.5677 5.5912 46.2592 7.4933 1.7052 0.6768 0.2254 1.0020 33.7453 11.7312 5.0369 21.6610 9.2273 5.9462 0.8456 6.0920 0.8117 4.7390 2.5789 12.9979 1.6486 0.9710 10.6339 24.2766 18.1142 3.7232 2.8988 2.7783 0.6809 5.9060 13.3416 14.0646 8.0561 2.0797 7.2726 1.5459 2.7032 8.4968 4.2753 12.6056 0.3937 16.7286 20.1703 33.5521 25.8668 17.7096 45.6433 70.0223 11.2816 3.0306 0.9458 3.8650 16.5842 36.7764 45.2610 22.0098 3.2628
temp: 298.150 k
press: 1.00000 atm
elementType: 8 6 6 6 6 6 6 6 6 6 6 6 6 6 6 6 6 6 6 6 6 1 1 1 1 1 1 1 1 1 1 1 1 1 1 1 1
symmnumber: 1
zpe: 786357.3 jmol-1
zpe.correction: 0.299508 hartree
zpe.thermalcorrener: 0.314741 hartree
zpe.thermalcorrenthalpy: 0.315685 hartree
zpe.thermalcorrgfe: 0.257870 hartree
zpe.sumelectzpe: -845.571782 hartree
zpe.sumelectthermal: -845.556548 hartree
zpe.sumelectthermalent: -845.555604 hartree
zpe.sumelectthermalfe: -845.613419 hartree
dipole: 1.0986 -0.1105 -1.4576
dipole: 1.8286
quadrupole: -118.5501 -107.1436 -129.7693
quadrupole: -0.3960 11.1024 -0.3362
quadrupole: -0.0624 11.3441 -11.2816 -0.3960 11.1024 -0.3362
hfenergy: -845.8712893 hartree
pointgroup: C01 [X(C20H16O1)]
dipole: -0.4321049 -0.0370076 0.5740114 debye
polarizability: 370.178293|11.0160894|236.0587762|13.681584|0.8847225|103.3706375 unknown
InChI: InChI=1S/C20H16O/c21-16-7-9-17-15(11-16)10-14-5-4-12-2-1-3-13-6-8-18(17)20(14)19(12)13/h1-6,8,10,16,21H,7,9,11H2
charge 0 multiplicity 1
37 atoms
O  4.625862 -0.07774 -1.574736
C  1.813996 -0.503909 0.216975
C  2.226535 0.859455 0.233157
C  2.839955 -1.636888 0.280287
C  4.64927 0.115569 -0.108226
C  3.702792 1.250242 0.324941
C  4.272458 -1.179641 0.637294
C  0.415478 -0.813639 0.123087
C  -0.561645 0.246813 0.067879
C  -0.125089 1.620883 0.093091
C  1.261797 1.891573 0.163245
C  -1.966392 -0.051156 -0.013411
C  -0.070723 -2.17924 0.076717
C  -2.415455 -1.420661 -0.048046
C  -2.935133 1.018415 -0.063315
C  -1.114981 2.676418 0.038102
C  -1.42184 -2.46883 -0.004116
C  -2.464807 2.387811 -0.034684
C  -3.808014 -1.697391 -0.126101
C  -4.317386 0.698752 -0.140362
C  -4.747046 -0.645985 -0.170557
H  2.516129 -2.39347 1.019704
H  2.859981 -2.166155 -0.695237
H  5.698134 0.38945 0.096736
H  3.892284 2.144625 -0.297373
H  3.945762 1.53393 1.369531
H  4.351235 -0.991766 1.726538
H  4.99078 -1.980278 0.385537
H  1.599702 2.936069 0.167486
H  0.64892 -3.00269 0.10228
H  -0.768627 3.716556 0.056634
H  -1.76137 -3.511053 -0.037245
H  -3.20592 3.194822 -0.073656
H  3.679956 -0.12983 -1.869655
H  -4.146396 -2.739808 -0.152072
H  -5.052488 1.511342 -0.177198
H  -5.816915 -0.873398 -0.230329
