program: Gaussian 09
title: 000186557
version: EM64L-G09RevD.01
frameworkgroup: C1[X(C21H18O2)]
method: RPBEPBE
basis: SDD
operation: Freq
keyword: #pfreq=noraman
keyword: PBEPBE/SDD
title: #p freq=noraman PBEPBE/SDD
converged: YES YES NO NO
title: Mulliken charges:
elementType: O O C C C C C C C C C C C C C C C C C C C C C H H H H H H H H H H H H H H H H H H
charge: -0.451553 -0.453209 0.162426 -0.244407 0.220497 0.026384 -0.467331 -0.553447 0.311048 -0.014603 -0.708553 -0.746479 0.523902 -0.002017 -0.452529 0.493301 0.477992 -0.504552 -0.510290 -0.484439 -0.470155 -0.466275 -0.245109 0.258143 0.226262 0.232484 0.239804 0.232778 0.288611 0.231240 0.245231 0.221922 0.245956 0.350174 0.354799 0.247088 0.235255 0.237728 0.243051 0.241705 0.227168
chargesum: 0.00000
title: Mulliken charges with hydrogens summed into heavy atoms:
elementType: O O C C C C C C C C C C C C C C C C C C C C C
charge: -0.101379 -0.098409 0.162426 0.013735 0.220497 0.026384 -0.008585 -0.080865 0.311048 -0.014603 -0.419942 -0.048086 0.523902 -0.002017 -0.206573 0.493301 0.477992 -0.257464 -0.275035 -0.246710 -0.227104 -0.224570 -0.017941
polarizability: 3.90831203e+02 -2.97580658e+00 2.48065335e+02 9.95737137e+00 2.99789253e+00 1.19478683e+02
1716.lowfreq: -7.5404 0.0004 0.0006 0.0008 5.7088 14.0160 46.0150 50.7622 96.5375
frequency: 46.0120 50.6022 96.5362 134.3445 160.2081 176.9645 193.4646 200.0714 219.0621 235.2659 244.6669 264.7358 291.2941 327.1395 337.3301 371.6302 381.5025 382.0909 419.4114 435.0778 453.3865 476.5033 482.5734 510.3861 511.9637 522.0555 540.2177 546.0607 555.3442 563.3551 576.8497 599.3360 654.4818 666.8362 699.8751 723.0594 740.7023 753.6984 769.1723 781.0951 812.9192 826.8856 834.8029 847.2716 855.5065 868.5507 888.3293 913.0366 914.8974 933.4487 946.4183 967.4532 975.7960 983.1692 985.5284 991.1532 1034.5088 1045.3475 1073.2130 1084.8675 1113.6699 1119.5020 1131.5510 1149.7355 1165.8568 1180.1031 1194.2375 1196.0964 1206.6895 1225.3260 1240.3724 1242.7537 1257.8074 1292.1485 1307.3026 1321.5821 1328.3283 1335.1923 1357.0156 1363.5620 1373.5167 1383.9573 1386.4210 1412.0914 1427.8156 1431.2993 1433.4636 1456.2983 1461.5035 1465.1514 1470.7544 1476.4218 1491.4039 1497.4547 1553.3923 1589.7079 1606.7094 1606.9990 1637.3675 2954.7285 2991.9613 3002.3340 3015.9487 3063.2912 3067.3393 3093.2542 3099.4631 3121.7916 3122.9274 3124.7108 3132.2202 3142.7212 3146.7253 3156.9175 3160.0319 3461.9869 3530.7704
redmass: 4.9771 4.3848 4.2947 3.6809 3.6170 3.8988 3.1272 1.1965 3.6281 3.6129 3.6402 5.5616 3.4957 3.7854 3.0460 2.8559 2.5505 1.5621 3.5076 5.6773 3.8883 5.7893 5.0589 5.0195 3.7150 3.6117 3.4497 2.7911 3.0543 4.7156 1.7094 3.9467 4.9494 3.7404 3.7150 2.7819 4.0517 2.6722 1.2513 6.0395 4.6000 1.4713 2.5254 3.1519 2.9687 2.4205 3.0486 1.4765 2.2023 1.6319 2.4596 2.3301 1.3669 3.4482 1.5609 1.4182 2.2035 2.5719 2.3247 1.8909 2.1644 2.2028 1.9966 1.3454 1.2983 1.3118 1.5784 1.4649 1.9822 1.7325 1.5178 1.4579 1.9216 2.2272 1.5509 1.8295 2.3157 1.9430 1.5143 1.3556 2.0707 3.5839 1.2718 2.5207 4.5914 5.1413 2.4631 1.0992 1.1445 3.2206 1.2105 1.2262 4.4960 2.8864 5.1958 7.2354 6.5163 6.8075 7.5225 1.0661 1.0357 1.0730 1.0810 1.1014 1.0882 1.0999 1.0996 1.0861 1.0862 1.0876 1.0917 1.0914 1.0979 1.0989 1.0948 1.0644 1.0652
irintensity: 0.0918 0.3155 2.5757 0.7432 2.7991 4.7369 1.9732 0.7582 6.8748 3.2040 3.3155 5.1400 0.5072 2.5994 8.0049 9.8888 12.7682 38.4194 1.5001 5.2763 2.3191 1.7081 4.0821 1.3767 2.0280 8.8241 9.9525 15.8224 7.1979 3.9215 153.7710 34.2016 2.5873 0.2066 2.5414 9.7025 5.7675 36.6730 5.0387 5.9097 3.5699 0.5333 10.4579 37.7086 9.1730 67.0615 4.6578 3.8017 20.2719 42.3107 11.8965 23.7401 0.9634 2.1155 3.3585 0.5581 52.6390 15.0279 38.9059 0.9560 3.5601 3.3991 25.4508 35.3735 14.4970 0.1242 6.7790 20.1767 3.5455 21.7808 13.7258 23.7112 1.8715 9.7859 6.1186 11.5431 14.4800 18.8301 22.1958 48.0892 4.4759 0.4149 26.7200 4.0986 1.1671 3.8706 4.8326 15.8369 8.1934 6.7884 1.1128 12.9385 5.2020 0.9391 0.5216 4.5866 2.9190 11.3289 0.0908 19.0407 17.0646 15.8844 38.2786 28.0391 43.9635 44.0001 17.3730 1.2527 0.3680 4.8829 16.8565 0.3545 32.6262 46.2435 22.4142 32.5341 3.5586
temp: 298.150 k
press: 1.00000 atm
elementType: 8 8 6 6 6 6 6 6 6 6 6 6 6 6 6 6 6 6 6 6 6 6 6 1 1 1 1 1 1 1 1 1 1 1 1 1 1 1 1 1 1
symmnumber: 1
zpe: 868232.6 jmol-1
zpe.correction: 0.330692 hartree
zpe.thermalcorrener: 0.348412 hartree
zpe.thermalcorrenthalpy: 0.349356 hartree
zpe.thermalcorrgfe: 0.286734 hartree
zpe.sumelectzpe: -959.938934 hartree
zpe.sumelectthermal: -959.921214 hartree
zpe.sumelectthermalent: -959.920270 hartree
zpe.sumelectthermalfe: -959.982892 hartree
dipole: 1.3756 -2.2999 -1.0535
dipole: 2.8796
quadrupole: -128.7641 -123.1039 -139.1978
quadrupole: 7.9833 7.9821 1.0043
quadrupole: 1.5911 7.2514 -8.8425 7.9833 7.9821 1.0043
hfenergy: -960.2696265 hartree
pointgroup: C01 [X(C21H18O2)]
dipole: -0.5344602 -0.9053804 0.4220464 debye
polarizability: 390.6524975|4.5051318|248.0552974|11.3005916|-4.3291489|119.6674263 unknown
InChI: InChI=1S/C21H18O2/c1-21(23)17-11-14-6-5-12-3-2-4-13-7-8-16(20(14)19(12)13)15(17)9-10-18(21)22/h2-8,11,18,22-23H,9-10H2,1H3
charge 0 multiplicity 1
41 atoms
O  3.807778 1.939809 -0.621949
O  4.046576 -0.546342 -1.760551
C  3.443833 0.786071 0.227158
C  4.232482 -0.446842 -0.288101
C  1.928068 0.510634 0.141346
C  1.393682 -0.809446 0.180344
C  3.80719 -1.728102 0.439589
C  2.301854 -2.039412 0.243601
C  -0.029445 -0.991496 0.123065
C  -0.90345 0.153229 0.039382
C  1.065812 1.626826 0.045518
C  3.856774 1.202207 1.651832
C  -0.339449 1.480344 0.000384
C  -2.330788 -0.015048 -0.011814
C  -0.641428 -2.306319 0.142863
C  -2.906745 -1.33656 0.018109
C  -3.195678 1.138069 -0.097041
C  -1.227485 2.62082 -0.08924
C  -2.015084 -2.47068 0.095114
C  -2.599117 2.45751 -0.133877
C  -4.320059 -1.484609 -0.03154
C  -4.60255 0.946329 -0.144787
C  -5.156769 -0.352193 -0.111321
H  5.313459 -0.256696 -0.181455
H  4.029879 -1.602361 1.515549
H  4.415088 -2.578452 0.081666
H  1.973543 -2.708378 1.061946
H  2.164725 -2.633612 -0.684374
H  1.515261 2.623974 -0.013352
H  4.952889 1.324746 1.709829
H  3.391149 2.174185 1.888217
H  3.526935 0.471379 2.409298
H  -0.00321 -3.193245 0.197075
H  3.883226 1.57893 -1.548818
H  3.107776 -0.814757 -1.943433
H  -0.784019 3.622764 -0.120676
H  -2.450786 -3.476842 0.114686
H  -3.262193 3.328013 -0.200286
H  -4.754156 -2.490931 -0.007786
H  -5.259136 1.821947 -0.209032
H  -6.244031 -0.480061 -0.148835
