program: Gaussian 09
title: 000186514
version: EM64L-G09RevD.01
frameworkgroup: C1[X(C10H13BrO2)]
method: RPBEPBE
basis: SDD
operation: Freq
keyword: #p
keyword: freq=noraman
keyword: PBEPBE/SDD
title: #p freq=noraman PBEPBE/SDD
converged: YES YES NO NO
title: Mulliken charges:
elementType: Br O O C C C C C C C C C C H H H H H H H H H H H H H
charge: 0.000568 -0.200525 -0.189899 -0.045666 -0.378098 -0.614778 -0.700092 -0.701862 0.189265 0.283049 -0.347412 -0.249741 -0.180859 0.209893 0.264486 0.224859 0.301412 0.220118 0.199175 0.219179 0.213548 0.242527 0.202547 0.271336 0.297470 0.269501
chargesum: 0.00000
title: Mulliken charges with hydrogens summed into heavy atoms:
elementType: Br O O C C C C C C C C C C
charge: 0.000568 -0.200525 -0.189899 0.164227 0.111247 -0.313366 -0.061621 -0.043240 0.189265 0.283049 -0.076076 0.047729 0.088641
polarizability: 1.44884084e+02 4.94687017e+00 1.27281649e+02 -7.69180604e+00 9.61995264e+00 1.09423738e+02
1716.lowfreq: -9.8101 -4.7353 -0.0005 -0.0002 0.0006 9.3464 26.8564 44.4879 50.9678
frequency: 26.5779 44.2849 50.9646 83.5559 101.8758 132.4286 179.2458 191.5135 204.6419 220.3916 270.9717 278.1131 345.4263 362.8793 386.5289 458.7089 500.6497 566.5342 590.0616 631.9949 685.2287 732.3431 750.8018 781.8753 828.1573 845.0989 863.1290 872.8454 907.7474 932.6607 955.6426 964.9316 968.9232 999.3830 1041.2255 1082.4674 1106.3246 1127.1415 1133.4303 1162.3806 1187.8183 1211.2557 1225.7420 1265.5213 1290.0406 1316.4997 1344.5544 1358.8183 1367.1148 1381.6026 1399.3397 1450.6012 1464.3935 1477.4626 1480.1663 1482.4637 1488.7437 1552.6046 1584.1768 2967.7677 2970.6576 2973.8361 3012.9848 3055.4594 3063.0022 3068.9076 3072.7519 3083.5423 3087.2100 3227.8409 3268.6326 3277.0967
redmass: 4.7589 3.4346 4.1532 3.5095 6.1196 8.8148 4.1114 3.8482 5.6679 1.1794 2.7135 1.2530 3.5742 2.1590 2.1767 4.4157 4.5485 3.9648 3.8546 3.0016 3.4570 1.2715 3.0652 3.1233 1.7600 5.8683 1.5719 2.6886 1.4167 1.5664 2.1963 1.6508 2.7184 2.8885 2.3639 1.8322 1.4570 1.7299 1.9629 1.5311 2.0201 1.3001 1.3146 1.6615 1.6277 1.5572 1.4167 1.5221 3.7778 1.2071 1.2171 1.0890 1.0487 1.0558 3.0949 1.1965 1.0495 5.9058 9.3456 1.0364 1.0665 1.0527 1.0609 1.0984 1.0974 1.0978 1.0983 1.0935 1.0987 1.0937 1.0989 1.1084
irintensity: 0.6158 0.9871 0.1345 0.2410 0.3047 1.8515 0.8957 0.6941 2.6570 0.6172 4.9708 1.2142 1.7496 1.0140 5.0607 3.3187 14.4776 4.5310 18.1469 45.5545 5.5782 42.2788 13.5913 3.8940 39.2440 30.4061 14.0175 35.0907 4.0036 2.0421 1.6780 0.6790 15.5797 12.6185 28.3844 1.4684 10.1782 11.5515 78.7212 2.1555 14.5194 3.8833 0.4833 22.4077 42.9948 7.8049 8.1864 9.6663 10.3596 19.2184 16.0943 14.7041 2.5532 3.7366 31.5362 58.3358 16.1517 117.7873 109.0313 27.2390 6.8648 32.9908 19.0080 8.8299 103.2660 18.3908 36.6542 9.1216 31.3914 0.4633 4.0429 1.3871
temp: 298.150 k
press: 1.00000 atm
elementType: 35 8 8 6 6 6 6 6 6 6 6 6 6 1 1 1 1 1 1 1 1 1 1 1 1 1
symmnumber: 1
zpe: 543270.3 jmol-1
zpe.correction: 0.206921 hartree
zpe.thermalcorrener: 0.220884 hartree
zpe.thermalcorrenthalpy: 0.221828 hartree
zpe.thermalcorrgfe: 0.163832 hartree
zpe.sumelectzpe: -551.749536 hartree
zpe.sumelectthermal: -551.735573 hartree
zpe.sumelectthermalent: -551.734629 hartree
zpe.sumelectthermalfe: -551.792625 hartree
dipole: 0.1064 -1.4609 2.9985
dipole: 3.3371
quadrupole: -80.9179 -90.6639 -88.2770
quadrupole: -2.4606 -2.6873 0.5065
quadrupole: 5.7017 -4.0443 -1.6574 -2.4606 -2.6873 0.5065
hfenergy: -551.9564569 hartree
pointgroup: C01 [X(C10H13Br1O2)]
dipole: -0.2070687 1.1331408 -0.630002 debye
dipolederiv: -0.244579 -0.0280614 0.0434439 -0.0569835 -0.450797 -0.2318934 0.0305078 -0.2613811 -0.3428782 -0.7771016 0.0362868 -0.0090763 0.0856039 -0.3178239 0.1654019 -0.3382551 0.0545566 -0.7445558 -0.8777508 0.0791648 0.1012983 0.1161559 -0.1557682 0.0177899 -0.1354733 0.0694162 -0.3045507 0.1278886 -0.0329115 -0.0301006 0.1212346 0.2984729 0.0422081 -0.0207555 -0.0255247 0.1524305 -0.0096958 0.0011644 0.0144631 -0.115984 -0.191453 -0.1116551 0.052367 -0.0304519 -0.004641 0.0437841 0.199829 0.1682237 0.1338442 0.5855877 0.281127 0.209984 0.3226251 0.1217418 0.0921788 -0.0001509 0.0206557 -0.033572 -0.051536 0.0477078 0.0073094 0.0476353 -0.0520601 0.061466 0.0489638 0.060959 -0.0104674 -0.0149911 -0.0092201 0.0745592 -0.0040141 -0.0467339 1.6439009 -0.2766883 -0.1532773 -0.1936175 0.1171329 -0.1741124 0.0930549 -0.0298379 0.8341782 -0.9674735 0.1259535 0.0315619 0.0111516 -0.0225417 0.0220186 0.2199017 -0.0102749 -0.0675754 -0.0237409 -0.0348632 0.0213379 -0.0846269 -0.1322792 -0.0119703 0.0880562 -0.0373892 -0.0013696 0.7978048 -0.1115739 -0.0732145 -0.0426556 -0.0442563 -0.0041994 -0.1823566 0.0144238 0.0235585 0.0632674 0.0135127 -0.1088959 -0.0128863 -0.1226835 -0.0565228 0.025547 -0.0879858 0.224166 -0.1776013 -0.0136067 -0.0847075 -0.0315362 -0.0170231 -0.0144914 -0.0852218 -0.0023746 -0.0034057 0.1141887 -0.0250577 -0.0120782 0.0066024 -0.0030304 0.0666463 -0.0887301 0.0665304 -0.0077212 -0.0426847 0.0100231 0.0689728 0.0222783 0.0622746 -0.0456563 0.1025273 -0.0819355 -0.0186255 0.0442762 0.0631131 -0.0408139 0.0717437 -0.0735371 0.0290153 -0.0208353 -0.0193939 -0.0180744 0.06316 -0.0790301 -0.010885 -0.0969056 -0.1720969 -0.0203046 -0.0305697 -0.0624984 0.0732966 -0.148968 0.0182669 -0.1133422 0.0033764 0.1045952 0.0062479 -0.0722807 0.0108276 0.0215352 -0.0122397 0.0471879 0.1175265 0.09299 0.061267 -0.0759475 0.112374 -0.0327752 -0.0641458 0.0374493 -0.0859653 -0.0247024 -0.0800369 -0.1712169 -0.1152365 -0.0035957 -0.0671266 0.0747216 0.0840491 0.0059292 0.0335912 0.0169412 0.0388993 0.1297432 0.0550753 0.0946696 -0.054425 -0.1626387 0.0077031 -0.056218 0.0307345 0.0986696 0.0011945 -0.1186339 -0.0008691 0.0112455 0.1251094 -0.0103989 0.0705567 0.0062464 0.1652325 0.0134108 0.0608194 0.0175442 0.0315776 0.0993017 0.0104493 0.0056552 0.0153033 0.1981301 0.0179202 -0.0171296 0.0247565 0.0847609 0.046649 0.0307604 -0.040934 0.0250655 0.2107724 0.0307785 -0.0182458 0.0308476 0.07755 unknown
polarizability: 146.9083504|-1.3238413|110.5225948|-0.1247476|12.2830179|124.1585266 unknown
InChI: InChI=1S/C10H13BrO2/c1-7(2)5-9(11)10(12)8-3-4-13-6-8/h3-4,6-7,9H,5H2,1-2H3
charge 0 multiplicity 1
26 atoms
Br 0.940936 -2.195066 -1.724561
O  0.250253 -1.032794 1.64824
O  -3.761541 -0.213039 0.393075
C  2.672309 1.320745 0.23982
C  2.390135 -0.182476 -0.087747
C  0.975213 -0.448581 -0.609572
C  2.702836 2.201083 -1.034131
C  1.715037 1.910474 1.303314
C  -0.088922 -0.675639 0.482109
C  -1.504234 -0.438656 0.123461
C  -2.093816 -0.097996 -1.166437
C  -2.558965 -0.496763 1.032249
C  -3.451347 0.02736 -0.968395
H  3.694384 1.328162 0.672767
H  2.541898 -0.798894 0.816945
H  3.122304 -0.508658 -0.848193
H  0.644937 0.297803 -1.348991
H  3.026901 3.228847 -0.787201
H  1.703254 2.28055 -1.503841
H  3.401961 1.795617 -1.789073
H  2.04616 2.922892 1.599551
H  1.676206 1.276332 2.206237
H  0.681893 2.003699 0.915197
H  -1.575762 0.00222 -2.117965
H  -2.605998 -0.710011 2.095631
H  -4.300032 0.253988 -1.606287
