program: Gaussian 09
title: 000015732
version: EM64L-G09RevD.01
frameworkgroup: C1[X(C24H16N2O2)]
method: RPBEPBE
basis: SDD
operation: Freq
keyword: #p
keyword: freq=noraman
keyword: PBEPBE/SDD
title: #p freq=noraman PBEPBE/SDD
converged: NO YES NO NO
title: Mulliken charges:
elementType: O O N N C C C C C C C C C C C C C C C C C C C C C C C C H H H H H H H H H H H H H H H H
charge: -0.281774 -0.281753 -0.079578 -0.079819 0.339696 0.339548 0.054115 0.054303 -0.363087 -0.363068 -0.374764 -0.374734 0.293508 0.293495 0.312051 0.312185 -0.430513 -0.430483 -0.359820 -0.359928 -0.375160 -0.375153 -0.236120 -0.236103 -0.227049 -0.227048 -0.240731 -0.240745 0.255216 0.255177 0.273724 0.273748 0.261089 0.261100 0.228852 0.228870 0.257145 0.257175 0.230191 0.230185 0.229975 0.229968 0.233056 0.233056
chargesum: 0.00000
title: Mulliken charges with hydrogens summed into heavy atoms:
elementType: O O N N C C C C C C C C C C C C C C C C C C C C C C C C
charge: -0.281774 -0.281753 -0.079578 -0.079819 0.339696 0.339548 0.054115 0.054303 -0.107871 -0.107891 -0.101040 -0.100986 0.293508 0.293495 0.312051 0.312185 -0.169423 -0.169383 -0.130968 -0.131058 -0.118015 -0.117978 -0.005929 -0.005917 0.002926 0.002921 -0.007676 -0.007689
polarizability: 7.41753316e+02 -1.82253300e-02 3.28467994e+02 -3.76989023e-02 2.68177347e-02 1.04527970e+02
1716.lowfreq: -0.0011 0.0007 0.0013 2.3685 4.7677 6.8077 24.9088 28.4809 32.5675
frequency: 24.8882 28.4809 32.1570 41.4942 45.5522 65.5783 72.1968 94.2794 106.5542 131.5363 139.2024 166.5891 183.6969 207.2343 269.2299 291.2195 303.2757 351.2886 375.0376 377.8656 400.3694 400.4386 400.8390 407.0880 489.1956 494.0710 494.4584 496.3926 523.4777 526.9380 615.0788 615.2223 628.3435 654.3893 654.7043 673.8744 679.9004 686.1108 691.6592 696.0811 697.0282 726.3962 758.3192 774.9517 775.2210 839.2065 839.4207 852.3308 853.3618 854.2369 874.1102 877.8466 878.5921 915.6211 915.9688 926.7922 926.9490 981.2825 981.4179 985.7908 987.0966 987.2416 992.4667 997.5487 999.9298 999.9537 1005.2238 1007.9773 1008.4220 1031.4833 1038.0064 1039.3798 1083.3491 1083.7244 1098.9312 1117.0758 1131.3028 1175.4731 1175.4768 1191.0225 1193.1798 1193.6275 1232.7152 1232.9491 1266.6635 1267.5972 1284.4573 1284.8134 1311.3435 1327.7714 1328.2809 1371.4627 1382.6950 1383.3459 1430.4433 1439.3092 1440.4732 1446.4381 1468.2124 1468.5658 1511.4585 1551.3915 1558.2351 1559.0958 1578.7061 1585.6380 1585.8200 1616.4876 1618.0183 1623.1171 3129.1754 3129.1950 3136.7031 3136.7293 3149.1789 3149.2227 3153.3451 3154.7975 3160.9339 3160.9977 3171.9238 3172.1373 3172.2047 3176.2256 3243.2196 3243.4663
redmass: 5.8961 6.1488 4.5563 3.9742 3.9033 6.0089 4.7449 6.6390 5.9331 5.8078 5.9790 6.9793 5.2386 6.5893 5.7604 6.2667 5.4569 7.5535 7.3928 6.1574 5.5811 2.8131 2.8485 2.9004 3.5003 3.4961 6.6990 6.7293 3.0900 5.7563 6.4647 6.4679 7.1468 3.2654 3.2854 6.7185 6.6459 7.4791 4.1470 1.9175 2.1582 7.1509 4.0683 1.7825 1.8074 1.4440 1.4422 1.3090 1.2703 1.2992 1.5272 11.0427 11.2830 8.2147 8.2051 1.4386 1.4389 1.3843 1.3843 1.3700 6.2421 6.2617 7.0596 8.9349 1.3241 1.3242 1.3641 5.8497 5.3773 2.6024 2.0989 2.1541 1.6040 1.6021 2.2309 2.3897 1.4868 1.0558 1.0555 1.1353 1.1305 1.1292 4.2630 4.6046 3.3801 4.2943 2.0310 2.0787 1.3102 1.3894 1.3877 5.7313 7.3492 7.6044 4.0509 2.4102 2.3938 2.6375 2.3173 2.2893 10.3561 6.5588 6.1051 6.1133 7.1113 6.2933 6.3099 5.9714 6.0467 6.1637 1.0850 1.0850 1.0881 1.0881 1.0934 1.0934 1.0878 1.0885 1.0962 1.0962 1.0966 1.1007 1.1006 1.0979 1.0984 1.0984
irintensity: 0.0000 0.1780 0.1136 0.0000 0.0178 0.2238 0.1245 0.0000 0.3372 0.1024 0.0000 0.0892 0.0067 1.6086 0.0000 3.6052 4.2154 3.6631 0.8738 0.0000 0.0000 0.0002 0.0000 0.0000 23.8236 0.0001 1.8769 2.1570 0.7200 2.8779 0.0001 0.1278 0.0804 10.6400 0.1145 9.4235 15.2648 0.0011 2.2092 0.0039 123.3198 2.1157 0.0000 131.1393 0.0222 20.8423 20.3591 25.2886 0.0082 0.7061 50.3924 2.8789 3.7291 27.5400 6.0249 0.2259 11.7536 0.0001 0.0605 0.0000 0.0339 0.1494 15.3694 10.2373 0.5353 0.0035 0.0000 0.4620 1.3412 0.0662 4.9860 10.2467 1.5921 1.4250 42.2175 1.8178 2.0335 0.3984 0.1173 0.0029 3.5091 0.0258 15.3419 6.7339 16.9359 0.0828 12.1414 1.3831 2.7112 0.6343 1.2224 0.4462 0.0642 0.0027 11.4554 0.7510 1.6037 145.5118 46.0444 105.2503 8.7823 5.8633 18.7405 2.1418 14.4414 1.2267 6.1864 0.7151 11.0571 7.5352 5.9030 4.0538 1.2004 0.9125 18.1587 27.5736 4.8073 2.6606 44.8778 20.1751 2.5274 21.9566 22.8386 0.1396 18.5665 12.9255
temp: 298.150 k
press: 1.00000 atm
elementType: 8 8 7 7 6 6 6 6 6 6 6 6 6 6 6 6 6 6 6 6 6 6 6 6 6 6 6 6 1 1 1 1 1 1 1 1 1 1 1 1 1 1 1 1
symmnumber: 1
zpe: 873894.1 jmol-1
zpe.correction: 0.332849 hartree
zpe.thermalcorrener: 0.354517 hartree
zpe.thermalcorrenthalpy: 0.355461 hartree
zpe.thermalcorrgfe: 0.278969 hartree
zpe.sumelectzpe: -1182.214848 hartree
zpe.sumelectthermal: -1182.193180 hartree
zpe.sumelectthermalent: -1182.192236 hartree
zpe.sumelectthermalfe: -1182.268728 hartree
dipole: -0.0001 3.3211 0.0004
dipole: 3.3211
quadrupole: -107.6148 -152.0895 -171.1663
quadrupole: -0.0014 -0.0060 0.0027
quadrupole: 36.0087 -8.4660 -27.5428 -0.0014 -0.0060 0.0027
hfenergy: -1182.547697 hartree
pointgroup: C01 [X(C24H16N2O2)]
dipole: 0.0002293 -1.3066381 -0.0001395 debye
polarizability: 741.7532912|0.102379|328.4680182|0.0376934|0.0268254|104.5279698 unknown
InChI: InChI=1S/C24H16N2O2/c1-3-7-17(8-4-1)21-15-25-23(27-21)19-11-13-20(14-12-19)24-26-16-22(28-24)18-9-5-2-6-10-18/h1-16H
charge 0 multiplicity 1
44 atoms
O  -3.584383 0.049065 -0.000141
O  3.585254 0.050639 0.000379
N  -3.697842 2.337306 0.000154
N  3.697651 2.338849 0.000483
C  -1.420422 1.252085 0.00017
C  1.420884 1.252507 0.000393
C  -2.873474 1.281725 0.000054
C  2.873896 1.282489 0.000478
C  -0.701586 0.023556 0.000069
C  0.702305 0.02378 0.000183
C  -0.700491 2.482349 0.000393
C  0.700532 2.482546 0.000495
C  -4.956928 0.412948 -0.000133
C  4.957991 0.415333 0.000394
C  -5.957745 -0.646585 -0.000242
C  5.959003 -0.644134 0.000232
C  -4.99611 1.806799 -0.000133
C  4.996191 1.809061 0.00069
C  -7.343973 -0.318892 -0.000564
C  7.345093 -0.316055 0.000582
C  -5.573939 -2.017328 -0.000045
C  5.575344 -2.014851 -0.000263
C  -8.317092 -1.336605 -0.000664
C  8.31842 -1.333608 0.000414
C  -6.553495 -3.030891 -0.000155
C  6.555127 -3.028222 -0.000414
C  -7.928472 -2.698097 -0.00046
C  7.930043 -2.695167 -0.000085
H  -1.253227 -0.921238 -0.000104
H  1.254225 -0.920868 0.000107
H  -1.264171 3.420241 0.000479
H  1.263991 3.420579 0.000652
H  -5.864225 2.459984 -0.000148
H  5.864003 2.462688 0.000804
H  -7.657543 0.730961 -0.000752
H  7.65845 0.733851 0.000999
H  -4.51004 -2.273661 0.000201
H  4.51151 -2.271397 -0.000529
H  -9.379666 -1.070193 -0.000909
H  9.380953 -1.067009 0.000681
H  -6.24497 -4.082054 -0.000002
H  6.246818 -4.079453 -0.000794
H  -8.687544 -3.487651 -0.000546
H  8.689254 -3.48458 -0.000205
