program: Gaussian 09
title: 000186480
version: EM64L-G09RevD.01
frameworkgroup: C1[X(C13H15NO3)]
method: RPBEPBE
basis: SDD
operation: Freq
keyword: #p
keyword: freq=noraman
keyword: PBEPBE/SDD
title: #p freq=noraman PBEPBE/SDD
converged: YES YES NO NO
title: Mulliken charges:
elementType: O O O N C C C C C C C C C C C C C H H H H H H H H H H H H H H H
charge: -0.203473 -0.231916 -0.201175 -0.309560 -0.205864 0.213688 0.146034 0.386554 0.386639 -0.715650 0.241091 -0.415399 -0.433023 -0.436159 -0.822147 -0.829879 -0.221927 0.251984 0.243634 0.252399 0.236190 0.281036 0.235183 0.237519 0.235761 0.229211 0.261807 0.234984 0.264416 0.233946 0.225986 0.228110
chargesum: 0.00000
title: Mulliken charges with hydrogens summed into heavy atoms:
elementType: O O O N C C C C C C C C C C C C C
charge: -0.203473 -0.231916 -0.201175 -0.309560 0.046120 0.213688 0.146034 0.386554 0.386639 0.016574 0.241091 0.100820 -0.195504 -0.200399 -0.096146 -0.105531 0.006182
polarizability: 1.74922736e+02 1.68143306e+00 1.42823290e+02 -3.01219696e+00 6.58838666e+00 1.26654750e+02
1716.lowfreq: -15.3917 -10.5619 -0.0002 0.0005 0.0009 8.2918 25.8878 47.0752 74.0233
frequency: 25.6157 46.9653 74.0090 87.4461 114.2499 119.8626 127.4560 146.0440 186.7502 191.9130 199.0956 226.5087 280.2582 299.1916 321.9838 342.6046 377.4372 401.0112 463.0426 469.3270 489.2971 518.7988 525.8256 535.1213 562.5177 583.6595 596.0456 645.7541 732.0372 749.9640 759.0470 776.2014 784.3853 900.7980 910.1394 917.2353 945.1523 977.5381 983.2853 987.0349 1002.7116 1040.2929 1041.1332 1046.5979 1051.2154 1071.5882 1092.6305 1132.5501 1149.3266 1179.9905 1184.1918 1211.2032 1259.0002 1271.0892 1289.0073 1301.4465 1328.1452 1358.7590 1367.8327 1397.9414 1399.5306 1408.2397 1442.2682 1449.0726 1454.4284 1462.8218 1469.3682 1470.3413 1473.6539 1481.9196 1485.1818 1598.8806 1603.4484 1620.4613 1678.2580 2911.0161 2975.3486 2981.5034 2991.2394 3015.4675 3052.1318 3058.4144 3090.1758 3090.7682 3117.0644 3119.1557 3124.9402 3135.1894 3141.1057 3158.8122
redmass: 5.1418 4.6937 4.4249 7.3067 2.7324 1.0937 1.4685 1.9869 2.0408 2.1824 1.9676 2.7968 3.4844 2.8668 3.5596 3.7341 4.7521 4.8326 6.1690 4.3133 4.6851 3.5812 3.5961 4.3257 4.9428 5.3045 4.4047 4.8244 4.8010 4.2783 4.4067 3.4363 1.2663 1.3093 3.4807 2.6049 4.9571 2.1549 1.3641 1.6907 2.6807 1.7345 1.6613 1.6012 1.9050 3.5404 1.8059 2.2973 3.1360 1.1651 1.4254 2.6736 1.5867 2.8383 1.5836 1.3705 1.3530 5.1643 7.5344 1.2354 1.2314 1.2083 2.1784 1.0914 1.8033 1.0450 1.0526 1.0498 1.0675 1.2827 1.3565 6.1485 7.8827 9.4562 11.6830 1.0815 1.0382 1.0377 1.0682 1.0360 1.0967 1.0972 1.0984 1.0986 1.1000 1.1012 1.0858 1.0920 1.0965 1.0994
irintensity: 0.4809 2.1812 0.5025 6.0245 0.4829 0.1646 1.9853 1.1517 4.3066 1.4283 3.8937 0.0509 4.7922 0.3097 8.9562 1.7507 4.4127 5.7997 2.3901 8.4198 13.2868 1.4737 0.8174 1.3790 5.9167 4.8206 4.1295 7.3268 3.7304 0.4255 3.7194 3.1731 49.0805 0.0566 3.9091 2.4664 44.1978 2.1361 1.5272 1.9592 9.7731 5.8431 22.5105 7.7433 15.1153 103.6372 28.8629 26.6090 31.7339 2.1558 2.4843 25.0907 0.2624 14.0782 40.2656 16.8467 3.0393 112.8662 5.5528 16.8778 18.0946 20.2567 16.0971 14.7471 0.5034 19.3641 29.0665 6.3694 13.3091 21.9510 35.8566 27.7173 5.9045 214.3650 239.6740 28.9699 28.3620 17.6464 21.5737 9.1094 16.0785 13.4084 20.4955 23.9705 15.4952 11.9312 0.2020 21.1930 1.4803 30.0021
temp: 298.150 k
press: 1.00000 atm
elementType: 8 8 8 7 6 6 6 6 6 6 6 6 6 6 6 6 6 1 1 1 1 1 1 1 1 1 1 1 1 1 1 1
symmnumber: 1
zpe: 667620.7 jmol-1
zpe.correction: 0.254283 hartree
zpe.thermalcorrener: 0.270877 hartree
zpe.thermalcorrenthalpy: 0.271821 hartree
zpe.thermalcorrgfe: 0.209800 hartree
zpe.sumelectzpe: -783.561630 hartree
zpe.sumelectthermal: -783.545036 hartree
zpe.sumelectthermalent: -783.544092 hartree
zpe.sumelectthermalfe: -783.606113 hartree
dipole: -2.4932 1.2241 2.8674
dipole: 3.9920
quadrupole: -105.2396 -100.4023 -101.2489
quadrupole: 13.3878 -2.4897 10.8534
quadrupole: -2.9427 1.8947 1.0480 13.3878 -2.4897 10.8534
hfenergy: -783.815913 hartree
pointgroup: C01 [X(C13H15N1O3)]
dipole: -0.86563 -0.3389397 1.2659089 debye
polarizability: 174.3128144|4.4356023|130.1235491|-4.5895923|8.9410941|139.9644124 unknown
InChI: InChI=1S/C13H15NO3/c1-8-5-4-6-9(2)12(8)14-10(3)13(16)17-7-11(14)15/h4-6,10H,7H2,1-3H3
charge 0 multiplicity 1
32 atoms
O  3.166747 0.429364 -0.644167
O  0.253561 2.543937 -0.427772
O  3.211122 -1.859553 -0.680844
N  0.465797 0.272959 0.148711
C  1.420639 -0.773388 0.653967
C  -0.963506 0.010201 0.056203
C  0.961367 1.537799 -0.136204
C  -1.50513 -0.395073 -1.19361
C  -1.773735 0.193183 1.209102
C  0.787729 -2.163158 0.796769
C  2.659416 -0.823624 -0.273457
C  2.490197 1.623763 -0.065136
C  -2.896073 -0.656095 -1.260664
C  -3.158812 -0.079399 1.103001
C  -0.631666 -0.513765 -2.428004
C  -1.174434 0.70046 2.507549
C  -3.716417 -0.50685 -0.121786
H  1.794692 -0.452081 1.653882
H  0.400498 -2.529108 -0.167636
H  1.560412 -2.871041 1.137721
H  -0.037828 -2.151065 1.526359
H  2.828419 2.474901 -0.670546
H  2.827841 1.758866 0.9822
H  -3.334227 -0.971485 -2.214392
H  -3.800291 0.055302 1.981421
H  -1.208677 -0.905888 -3.28206
H  -0.226033 0.473457 -2.71777
H  0.234076 -1.182821 -2.268181
H  -0.729073 1.702588 2.365534
H  -1.944399 0.779301 3.293096
H  -0.375481 0.035332 2.887688
H  -4.790131 -0.713718 -0.190768
