program: Gaussian 09
title: 000186498
version: EM64L-G09RevD.01
frameworkgroup: C1[X(C16H17NO3S)]
method: RPBEPBE
basis: SDD
operation: Freq
keyword: #p
keyword: freq=noraman
keyword: PBEPBE/SDD
title: #p freq=noraman PBEPBE/SDD
converged: YES YES NO NO
title: Mulliken charges:
elementType: S O O O N C C C C C C C C C C C C C C C C H H H H H H H H H H H H H H H H H
charge: 0.923600 -0.300228 -0.533055 -0.525817 -0.301218 0.017709 -0.423669 -0.371716 -0.594209 0.007660 0.466631 -0.286544 -0.242195 -0.359601 -0.363941 -0.206984 -0.204251 -0.236841 -0.237939 -0.217284 -0.240093 0.294934 0.237391 0.251485 0.225953 0.209058 0.274304 0.238236 0.299245 0.278112 0.273856 0.243390 0.242911 0.242602 0.226018 0.227658 0.239076 0.225759
chargesum: 0.00000
title: Mulliken charges with hydrogens summed into heavy atoms:
elementType: S O O O N C C C C C C C C C C C C C C C C
charge: 0.923600 -0.300228 -0.533055 -0.525817 -0.301218 0.312643 0.065207 0.063295 -0.081669 0.007660 0.466631 0.012700 0.035917 -0.085745 -0.120552 0.035927 0.038351 -0.010824 -0.010281 0.021792 -0.014334
polarizability: 2.79515350e+02 4.82128047e+00 1.80447860e+02 -1.36197851e+01 1.79538293e+00 1.64260103e+02
1716.lowfreq: -7.5382 -4.8363 0.0017 0.0020 0.0024 7.3383 23.2085 32.4927 35.5546
frequency: 22.8575 32.2602 35.3271 40.8632 64.3064 76.0380 85.1398 97.7681 128.0546 152.6262 176.0060 198.6978 207.0906 213.8967 247.7825 265.7036 315.2897 340.4872 354.9796 363.5179 397.1278 400.4658 404.3640 407.1836 457.1006 491.1951 494.2015 545.7440 602.8647 616.7819 620.1826 660.1304 690.0444 700.0361 708.2050 741.8878 759.7918 793.0147 806.9466 813.0508 822.6163 849.6629 858.4038 889.4265 896.4756 924.4624 934.5962 936.1856 970.7429 978.4951 982.2939 984.9970 990.9025 1002.7560 1006.1487 1008.5574 1028.1009 1035.0225 1048.5651 1074.4170 1076.7945 1088.8792 1108.9494 1111.8926 1140.1204 1172.8027 1173.5769 1177.7793 1194.7057 1206.6409 1228.1725 1239.1500 1272.9390 1303.0593 1327.7009 1333.9619 1344.3437 1375.9057 1384.2617 1384.9050 1422.0278 1430.3143 1436.1325 1443.9780 1453.4540 1480.7113 1483.2388 1577.6346 1592.6160 1604.1332 1613.7080 2972.2552 2995.2367 3029.9740 3056.7483 3062.3971 3121.8758 3128.1851 3135.9442 3137.6582 3137.7146 3147.7674 3149.1198 3156.7186 3163.6573 3166.3252 3166.5930 3175.9077
redmass: 5.5437 4.0345 4.7773 5.2955 5.0794 4.3218 5.6608 4.2383 5.8006 5.8539 5.0796 5.4467 6.2613 6.2961 7.9091 4.4149 4.1840 5.7868 2.2642 4.3771 4.2417 2.7072 2.8067 3.1140 4.6090 4.0922 4.4332 5.5599 6.4764 5.8317 5.0262 7.0367 2.3763 3.9749 2.2487 2.0318 1.4481 13.8091 2.5655 3.3494 3.5900 1.2492 1.2574 2.4435 1.8574 13.6593 1.3756 1.4876 1.6084 5.1375 1.4283 1.4240 5.1482 1.3336 1.3322 4.0940 2.2669 1.4046 2.1459 2.1939 1.6149 1.6028 1.6104 1.3557 2.2639 1.0554 1.0603 1.1212 1.2023 2.3800 1.5712 1.4395 1.2531 1.3023 1.2142 1.2257 1.2113 1.8471 8.3470 6.3984 1.0876 1.1217 2.2195 2.1208 2.0346 1.1792 2.1981 5.8143 5.9907 6.9283 5.9305 1.0594 1.0620 1.1011 1.0542 1.1002 1.0850 1.0882 1.0928 1.0921 1.0861 1.0887 1.0965 1.0929 1.1016 1.0969 1.1160 1.1013
irintensity: 0.5301 0.3371 0.0565 1.5599 3.2237 1.4941 0.9078 9.1608 0.2537 1.8681 3.4940 0.2656 2.3032 5.3131 11.6821 3.1219 6.3743 2.9121 0.8713 21.0426 27.8196 11.3460 2.4470 3.2331 54.3871 27.8314 4.9043 80.2793 0.0066 12.0473 51.0638 20.3397 31.8987 27.4962 59.8284 66.6549 78.5893 56.9480 24.4007 13.0840 11.1147 0.8953 0.5197 38.9569 16.4719 75.1191 2.7904 2.1869 2.2523 1.7343 0.3429 0.3654 0.1024 1.0080 0.1875 1.4967 6.8482 0.9390 25.4506 19.2991 2.6519 11.6859 8.8389 1.1160 23.3227 0.1145 0.8125 8.2533 0.6363 17.8981 6.1722 15.8393 25.3062 3.6069 3.7061 3.8563 8.1937 8.0793 4.8383 1.9587 12.9559 30.8358 12.8639 8.1550 16.3405 1.3156 12.5449 4.2008 0.9959 0.4486 1.2702 12.5706 17.1799 6.0759 35.1631 1.8895 0.4784 2.4345 0.0473 12.2445 0.0900 9.6635 31.4037 2.2029 30.6166 7.5999 23.0697 25.2781
temp: 298.150 k
press: 1.00000 atm
elementType: 16 8 8 8 7 6 6 6 6 6 6 6 6 6 6 6 6 6 6 6 6 1 1 1 1 1 1 1 1 1 1 1 1 1 1 1 1 1
symmnumber: 1
zpe: 770636.8 jmol-1
zpe.correction: 0.293520 hartree
zpe.thermalcorrener: 0.313672 hartree
zpe.thermalcorrenthalpy: 0.314616 hartree
zpe.thermalcorrgfe: 0.242658 hartree
zpe.sumelectzpe: -1296.618315 hartree
zpe.sumelectthermal: -1296.598164 hartree
zpe.sumelectthermalent: -1296.597219 hartree
zpe.sumelectthermalfe: -1296.669178 hartree
dipole: 4.4247 3.5747 -1.8393
dipole: 5.9783
quadrupole: -108.7637 -131.9622 -129.5348
quadrupole: 6.9601 -5.6197 4.9861
quadrupole: 14.6566 -8.5420 -6.1146 6.9601 -5.6197 4.9861
hfenergy: -1296.9118353 hartree
pointgroup: C01 [X(C16H17N1O3S1)]
dipole: -1.7703918 -0.983928 -1.1956848 debye
polarizability: 278.2210219|-6.0377446|180.1810078|17.9017205|2.5390366|165.8212837 unknown
InChI: InChI=1S/C16H17NO3S/c18-21(19,16-9-5-2-6-10-16)17(12-15-13-20-15)11-14-7-3-1-4-8-14/h1-10,15H,11-13H2
charge 0 multiplicity 1
38 atoms
S  -0.909301 0.82546 0.610066
O  2.067852 -2.542286 -1.220122
O  -0.616842 2.421997 0.771002
O  -0.618989 -0.218792 1.837576
N  -0.057601 0.326751 -0.983787
C  0.887932 -2.02437 -0.420807
C  -0.093445 -1.138775 -1.188666
C  0.970919 -3.47751 -0.77512
C  1.175654 1.129132 -1.270131
C  -2.720786 0.585422 0.119577
C  2.442955 0.88483 -0.451186
C  -3.416944 -0.47739 0.715709
C  -3.300083 1.508652 -0.766095
C  2.602565 1.504345 0.817544
C  3.496598 0.087081 -0.962677
C  -4.783537 -0.632915 0.382343
C  -4.666289 1.336003 -1.08583
C  3.786746 1.313943 1.562271
C  4.68425 -0.098616 -0.220725
C  -5.401398 0.26765 -0.516472
C  4.832179 0.512656 1.045172
H  1.137222 -1.711296 0.599338
H  -1.128665 -1.467262 -0.966289
H  0.065611 -1.305695 -2.27295
H  1.261222 -4.203727 -0.006855
H  0.346762 -3.87176 -1.589571
H  0.863435 2.183782 -1.168388
H  1.368788 0.936487 -2.343872
H  -2.908634 -1.135418 1.428652
H  -2.712269 2.334299 -1.178575
H  1.798979 2.137236 1.212559
H  3.386652 -0.402324 -1.936935
H  -5.360732 -1.449203 0.828756
H  -5.154339 2.035326 -1.772488
H  3.896253 1.795545 2.540492
H  5.486022 -0.72473 -0.627332
H  -6.460246 0.143295 -0.767853
H  5.752602 0.368475 1.622573
