program: Gaussian 09
title: 000186472
version: EM64L-G09RevD.01
frameworkgroup: C1[X(C11H14N2O4)]
method: RPBEPBE
basis: SDD
operation: Freq
keyword: #p
keyword: freq=noraman
keyword: PBEPBE/SDD
title: #p freq=noraman PBEPBE/SDD
converged: YES YES NO NO
title: Mulliken charges:
elementType: O O O O N N C C C C C C C C C C C H H H H H H H H H H H H H H
charge: -0.227477 -0.245900 -0.226751 -0.226374 -0.311688 0.019600 0.136504 -0.678864 -0.688661 -0.684296 0.241358 0.429310 -0.377760 -0.316585 0.377327 -0.339105 -0.333043 0.232953 0.230743 0.225480 0.240968 0.215583 0.223112 0.217651 0.231841 0.223732 0.332868 0.240374 0.264246 0.287235 0.285618
chargesum: 0.00000
title: Mulliken charges with hydrogens summed into heavy atoms:
elementType: O O O O N N C C C C C C C C C C C
charge: -0.227477 -0.245900 -0.226751 -0.226374 0.021180 0.019600 0.136504 0.010312 -0.008998 -0.011073 0.241358 0.429310 -0.137386 -0.052339 0.377327 -0.051870 -0.047425
polarizability: 2.85883619e+02 -1.18337305e+01 1.51208883e+02 7.44338208e+00 2.60813178e+00 8.54100012e+01
1716.lowfreq: -0.0005 0.0002 0.0007 2.0562 7.2633 12.3395 15.5748 25.9942 44.4090
frequency: 14.6046 25.9690 44.3887 55.3056 80.4093 96.7112 160.3840 163.2210 183.0641 210.7171 234.3294 251.2719 254.1007 271.4902 299.8674 307.7322 343.6059 368.3321 373.5313 414.9036 425.7424 480.6561 490.5352 515.4888 555.4509 581.1926 624.7608 641.9883 663.5679 700.2989 725.9680 750.0792 785.4100 821.7830 835.2091 846.4503 884.6635 931.5272 941.1142 958.0710 967.7958 978.0399 987.9377 994.2774 1018.1359 1023.5916 1051.2231 1097.6061 1117.3742 1176.9326 1200.0746 1230.1390 1231.8155 1253.1273 1267.7365 1301.1051 1349.0130 1375.7634 1384.1253 1390.7845 1406.9346 1422.3402 1448.9278 1454.4068 1466.3537 1467.9981 1476.1684 1479.4419 1494.0623 1497.1698 1581.5753 1616.9316 1645.3740 2985.5990 2990.1262 2993.8087 3084.6249 3087.2652 3091.6047 3094.9407 3100.7853 3104.3764 3142.2602 3174.4586 3184.5787 3194.5102 3394.9970
redmass: 3.0211 8.1455 6.4933 5.2417 6.2847 7.9869 3.7818 4.1623 1.1074 4.9582 1.4849 1.9451 1.2896 3.3638 5.2152 3.2508 3.0485 2.5090 5.2492 3.0327 4.2663 2.7611 3.2251 3.9740 3.9151 2.5483 6.7726 4.8346 4.7342 6.1079 4.9351 6.3641 6.8103 1.3258 3.0553 1.6090 4.4061 1.7804 1.6328 1.2120 4.6123 1.3217 1.3451 2.8290 2.0246 1.5323 2.2529 3.1063 1.2618 1.3734 2.6926 4.7802 3.2032 2.8690 1.7884 1.4122 7.9710 1.1762 1.2017 2.8095 1.3114 2.1794 3.7743 1.0483 1.0491 1.0480 1.0509 1.0505 2.8779 1.1028 8.0520 6.5268 8.3244 1.0341 1.0354 1.0358 1.1007 1.1008 1.1001 1.1009 1.1001 1.0999 1.0902 1.0889 1.0949 1.0966 1.0777
irintensity: 0.0648 1.2224 0.8401 1.6473 0.3327 1.9751 4.5951 1.5670 0.3254 4.1106 0.5658 6.1342 0.9005 0.8522 8.1346 20.0004 9.3598 2.8741 14.6663 0.7275 11.9995 89.9084 37.2815 60.5225 32.0963 93.6525 1.3896 6.4088 24.4538 31.8636 3.0785 3.3442 37.3131 12.9101 6.4979 66.6781 75.9001 4.5389 5.6278 0.3783 40.3849 2.8551 0.4310 13.5078 184.6566 35.7373 306.0304 13.7224 20.4738 182.4572 6.5730 480.8527 31.6400 10.6461 27.6044 4.8882 92.7672 16.0450 24.3516 73.9329 17.7915 21.3565 4.7375 0.2286 0.5233 2.4256 18.0712 17.0550 57.3046 70.7229 25.3280 430.8160 116.6513 23.1219 15.5007 26.8124 7.3421 11.5343 48.5253 20.7458 35.5407 28.7071 5.9287 0.6890 1.7613 3.4403 171.3025
temp: 298.150 k
press: 1.00000 atm
elementType: 8 8 8 8 7 7 6 6 6 6 6 6 6 6 6 6 6 1 1 1 1 1 1 1 1 1 1 1 1 1 1
symmnumber: 1
zpe: 626796.0 jmol-1
zpe.correction: 0.238734 hartree
zpe.thermalcorrener: 0.256069 hartree
zpe.thermalcorrenthalpy: 0.257013 hartree
zpe.thermalcorrgfe: 0.191470 hartree
zpe.sumelectzpe: -836.578121 hartree
zpe.sumelectthermal: -836.560786 hartree
zpe.sumelectthermalent: -836.559842 hartree
zpe.sumelectthermalfe: -836.625385 hartree
dipole: 8.2720 -0.1338 0.3504
dipole: 8.2805
quadrupole: -130.2227 -97.4778 -101.3995
quadrupole: 15.1371 -0.6491 -0.4411
quadrupole: -20.5227 12.2222 8.3005 15.1371 -0.6491 -0.4411
hfenergy: -836.8168551 hartree
pointgroup: C01 [X(C11H14N2O4)]
dipole: -3.2301733 -0.0502533 0.4202594 debye
polarizability: 283.0790694|-5.6874587|148.2248203|-26.8592096|13.4880036|91.1986136 unknown
InChI: InChI=1S/C11H14N2O4/c1-11(2,3)10(14)17-12-8-4-6-9(7-5-8)13(15)16/h4-7,12H,1-3H3
charge 0 multiplicity 1
31 atoms
O  -1.753886 -0.099124 0.427415
O  -3.155067 1.742742 0.224608
O  5.484281 0.620826 -0.665106
O  4.910303 -1.564724 -1.007467
N  -0.732827 0.899428 0.725272
N  4.617076 -0.342457 -0.691156
C  -4.129094 -0.564281 0.089497
C  -4.528308 -0.973189 1.54423
C  -5.341255 0.076906 -0.632889
C  -3.62756 -1.810092 -0.68927
C  -3.034706 0.497979 0.217991
C  0.559391 0.565863 0.319337
C  1.550006 1.596113 0.334219
C  0.924877 -0.7665 -0.030576
C  3.225691 -0.030919 -0.342955
C  2.877533 1.297439 0.005198
C  2.255379 -1.060022 -0.363513
H  -3.672221 -1.411252 2.086427
H  -4.902826 -0.104513 2.114394
H  -5.333455 -1.728022 1.494607
H  -5.679974 0.988398 -0.11268
H  -6.174511 -0.647582 -0.658607
H  -5.08953 0.351777 -1.672612
H  -4.455613 -2.536662 -0.773558
H  -2.786392 -2.303446 -0.174389
H  -3.301952 -1.543192 -1.710532
H  -1.123142 1.849257 0.612178
H  1.271285 2.619898 0.607476
H  0.163229 -1.548933 -0.04135
H  3.652035 2.068736 0.007322
H  2.560833 -2.072553 -0.640408
