program: Gaussian 09
title: 000184662
version: EM64L-G09RevD.01
frameworkgroup: C1[X(C10H8O5)]
method: RPBEPBE
basis: SDD
operation: Freq
keyword: #pfreq=noraman
keyword: PBEPBE/SDD
title: #p freq=noraman PBEPBE/SDD
converged: YES YES NO NO
title: Mulliken charges:
elementType: O O O O O C C C C C C C C C C H H H H H H H H
charge: -0.414182 -0.401267 -0.254841 -0.208344 -0.164659 -0.089663 0.053948 0.239848 0.090905 0.031759 0.263559 -0.395791 -0.346039 -0.181010 -0.527728 0.283218 0.265734 0.245396 0.378126 0.378783 0.226447 0.288149 0.237652
chargesum: 0.00000
title: Mulliken charges with hydrogens summed into heavy atoms:
elementType: O O O O O C C C C C C C C C C
charge: -0.036057 -0.022484 -0.254841 -0.208344 -0.164659 -0.089663 0.053948 0.239848 0.090905 0.031759 0.263559 -0.112573 -0.080305 0.064386 0.224520
polarizability: 1.63322360e+02 -6.56819080e-01 1.53750107e+02 1.56670284e+00 2.14957591e+00 6.58143140e+01
1716.lowfreq: -7.9051 -4.8174 -3.2729 -0.0007 -0.0003 -0.0001 43.6766 68.2032 113.0637
frequency: 43.6717 68.1897 113.0628 145.0481 157.2387 189.7686 209.3805 224.8740 242.0220 271.0307 293.4667 314.6654 332.8853 387.5796 434.0092 446.2830 458.6299 474.3434 546.5642 552.2267 575.9466 590.5948 666.5345 703.8636 747.9907 776.3599 815.0133 832.8568 850.0656 923.1222 927.2514 960.8465 985.4504 998.3440 1017.8723 1052.5815 1108.7001 1119.2672 1156.5744 1168.3994 1213.4259 1248.7802 1256.9253 1321.9895 1345.3728 1408.9226 1419.4492 1432.4280 1452.9195 1470.0004 1473.2513 1555.9923 1599.0637 1625.0613 1657.9100 2990.6496 3102.0192 3143.4641 3148.0425 3168.8357 3179.2028 3482.9329 3516.3352
redmass: 7.8812 4.7983 3.3753 1.7820 2.9254 5.4610 5.7553 2.9895 5.2664 5.0380 4.4990 4.6697 5.7466 1.3918 3.0540 4.8766 4.6048 1.7601 7.7765 4.7907 5.9099 6.5230 4.7837 6.1283 4.6573 3.0771 6.6996 2.2296 5.3582 8.4084 1.4416 3.5838 8.1930 1.3974 4.9608 2.2800 2.1036 1.2507 1.4004 1.2169 2.2988 2.0024 6.2223 2.3205 1.7739 2.9465 3.3912 2.1534 1.0531 1.8489 1.0783 6.5108 7.5012 10.2913 12.1702 1.0320 1.1017 1.1052 1.0876 1.0924 1.0991 1.0647 1.0654
irintensity: 1.4935 0.1390 9.8594 0.3070 0.9875 7.0946 2.3688 1.4348 1.3986 4.2852 2.9161 27.3520 2.8657 110.6380 11.3713 15.1952 8.3518 115.1811 0.7156 8.4100 82.4549 37.4998 6.0475 4.2098 47.8018 9.6049 53.9582 36.9984 45.4686 53.0401 2.3687 87.1971 98.3117 10.4273 129.5910 25.7892 89.6458 2.6433 2.3853 0.7471 45.6612 19.8658 158.5245 67.5676 89.3506 7.6602 22.2204 0.3808 25.2171 49.8387 72.0802 25.4457 230.4618 112.0615 162.4547 43.8388 23.5484 10.7881 6.1200 0.6080 8.6505 25.7680 27.2359
temp: 298.150 k
press: 1.00000 atm
elementType: 8 8 8 8 8 6 6 6 6 6 6 6 6 6 6 1 1 1 1 1 1 1 1
symmnumber: 1
zpe: 425245.8 jmol-1
zpe.correction: 0.161968 hartree
zpe.thermalcorrener: 0.175444 hartree
zpe.thermalcorrenthalpy: 0.176388 hartree
zpe.thermalcorrgfe: 0.122101 hartree
zpe.sumelectzpe: -760.872942 hartree
zpe.sumelectthermal: -760.859465 hartree
zpe.sumelectthermalent: -760.858521 hartree
zpe.sumelectthermalfe: -760.912808 hartree
dipole: -3.7296 0.4882 1.1432
dipole: 3.9313
quadrupole: -85.4452 -80.2767 -87.3968
quadrupole: -7.1115 0.5425 -0.9714
quadrupole: -1.0724 4.0962 -3.0239 -7.1115 0.5425 -0.9714
hfenergy: -761.0349093 hartree
pointgroup: C01 [X(C10H8O5)]
dipole: 1.474311 -0.0893377 0.4590596 debye
dipolederiv: -0.4819256 0.2880731 0.1140772 0.2965281 -0.4941566 -0.1547781 0.0674849 -0.0912897 -0.8104605 -0.7374606 0.1731498 -0.2380638 0.202151 -0.2417164 0.0200565 -0.1140708 -0.0176073 -0.8082828 -0.6553246 -0.4824696 0.0226853 -0.6861937 -1.236385 0.0322941 0.2107461 0.1593049 -0.3088029 -0.5122423 -0.0043927 -0.0186123 0.1971153 -0.9164923 0.275528 -0.1279156 0.3571608 -0.4621534 -0.9275923 -0.1939338 0.0975193 -0.3201212 -0.5816007 0.0771166 0.166411 0.116327 -0.3166879 0.5561989 -0.2403149 0.1464932 -0.2872554 0.2031778 0.1959499 0.1135386 0.1361317 1.0799646 -0.51779 0.0630021 -0.0867328 0.5213838 -0.5761341 0.1715696 -0.104087 0.1321605 -0.1035454 -0.7580717 0.1398937 0.0164286 -0.1036706 0.2060385 -0.0572261 0.0739176 -0.0260846 0.0861499 0.8619793 -0.2848899 0.0261437 -0.4774798 1.0835204 -0.4728745 0.0792069 -0.4406819 0.3016636 1.4767332 0.0927143 -0.1370375 0.0930054 0.6848629 -0.164551 -0.0925052 -0.1825574 0.095704 0.5955529 0.5792008 0.0260138 0.8480428 0.9536494 -0.1060337 -0.1936276 -0.1711195 0.1651878 -0.2178525 0.1727958 -0.0744962 0.1023118 -0.0839661 -0.0026781 -0.0200015 -0.0260425 -0.1258567 0.1120502 0.0214248 -0.0272304 -0.2948697 -0.4073623 0.0145888 -0.01988 0.0171046 -0.1587439 0.2306033 -0.0870131 0.0289452 -0.0286261 0.1729222 -0.0395672 0.0010223 -0.0441319 -0.1051679 0.1321269 -0.081201 -0.0233577 0.2663259 0.7312121 0.0533785 -0.0235043 0.0733619 0.2536271 0.0706377 -0.0650585 0.0210731 -0.0278941 0.031816 0.03641 0.0050606 0.0387768 0.1596595 -0.0340945 0.0086238 0.0055881 -0.0129323 0.1032358 0.0159045 -0.0098923 -0.0012134 0.1640693 0.0412968 0.0819489 -0.0102253 0.0932716 -0.0356443 0.031904 0.0032131 0.0375772 0.145998 0.213211 -0.1260921 0.0333 -0.1860449 0.2572232 -0.0019487 -0.0130445 -0.0063918 0.3362018 0.4267479 -0.1381175 0.0289338 -0.0487606 0.1235573 0.0518741 0.0025754 0.0049285 0.3459565 0.070071 0.072435 0.1006997 -0.0591504 -0.0161282 0.0381539 0.0482504 -0.0508752 -0.0944039 0.1317624 0.1510025 -0.0612895 0.0026467 0.0474989 -0.0055268 -0.0443965 0.0126271 0.031684 -0.0766173 -0.1407816 0.0091445 -0.0897836 -0.0091288 -0.0095443 -0.0085016 -0.027466 0.1282393 unknown
polarizability: 163.2684231|-1.2326129|148.9163273|-2.6829778|-20.13657|70.7020309 unknown
InChI: InChI=1S/C10H8O5/c1-15-6-4-2-3-5-7(6)9(12)10(13,14)8(5)11/h2-4,13-14H,1H3
charge 0 multiplicity 1
23 atoms
O  -2.273271 1.17393 0.887992
O  -2.759875 0.522139 -1.374086
O  2.857697 0.933164 -0.5150
O  -0.284091 2.008463 -1.316848
O  -2.50554 -1.884054 0.4363
C  -1.842519 0.415745 -0.278478
C  0.560724 -0.091117 -0.278018
C  -0.143728 -1.299958 0.062451
C  -0.43026 0.942269 -0.657732
C  -1.61314 -1.069882 0.095713
C  1.988161 -0.121631 -0.31317
C  0.50681 -2.517895 0.301076
C  2.641646 -1.372621 -0.106363
C  1.920093 -2.544973 0.187247
C  2.445052 2.32908 -0.24123
H  -0.073018 -3.411345 0.549276
H  3.734606 -1.381463 -0.159615
H  2.466201 -3.480546 0.346992
H  -3.124794 0.772725 1.210625
H  -2.64377 1.426911 -1.776426
H  1.975633 2.393335 0.757862
H  1.738704 2.687175 -1.005756
H  3.385278 2.898451 -0.258911
